....
----------------------------------------------------------------------
Ran 4 tests in 0.001s

OK
Name               Stmts   Miss Branch BrPart  Cover   Missing
--------------------------------------------------------------
Diplomacy.py          56      0     26      0   100%
TestDiplomacy.py      28      0      0      0   100%
--------------------------------------------------------------
TOTAL                 84      0     26      0   100%
