1 10 20
100 200 125
201 210 89
900 1000 174
10 1 20
980000 999999 440
1 1 1
2 4 8
100000 500000 449
1 999999 525
123 321 131
101 102 26
555 777 171
10000 90000 351
1000 100000 351
837799 837799 525
18011 286889 443
599671 739567 509
819352 764520 468
232318 383418 441
744799 945507 525
305871 669267 509
409977 955015 525
337742 918217 525
236362 439567 449
709711 944979 525
287764 673623 509
313875 440966 449
613145 676917 509
366995 723708 509
758480 952175 525
468565 995072 525
128305 655688 509
710274 744973 424
429285 575135 470
57812 18455 340
604825 919480 525
890738 352618 525
785741 926499 525
507871 609635 470
759462 882937 525
910525 806373 525
272383 697059 509
305751 655411 509
221158 880528 525
947891 929989 507
598050 612679 403
201950 809873 509
522436 949383 525
747607 916719 525
431 845 171
416 969 179
679 209 145
5275 8588 262
5208 8689 262
2476 5451 238
800 8737 262
8857 9005 247
23712 62999 340
3858 22797 279
7776 76095 340
37014 31328 324
25790 65711 340
43030 94531 351
228955 359280 443
212042 383009 443
286486 344856 389
106599 141565 349
17 26 24
8 12 20
18 35 112
2 11 20
5 32 112
96 486 144
75 483 144
223 440 144
227 79 125
401 180 144
31078 62096 340
66833 67851 312
613 16248 276
12168 49572 324
23388 61236 340
24944 30033 308
66347 68605 312
110338 273373 443
234289 265159 407
51694 270825 443
17429 355490 443
59361 124784 354
34347 121929 354
341974 361206 441
104446 396080 443
269077 280043 407
97647 393990 443
44498 232880 443
196833 230367 386
17546 279289 443
269365 341942 407
90154 167482 383
1 100 119
200 300 128
300 400 144
500 600 137
600 700 145
700 800 171
800 900 179
1000 1100 169
1200 1300 177
1400 1500 172
1600 1700 180
1800 1900 175
2000 2100 157
1 1000 179
1000 10000 262
10000 100000 351
100000 999999 525
50 10 112
506 255 144
123 9 119
29489 2395 308
90823 2389 351
967847 923478 507
765 432 171
321 987 179
53893 590 340
10 10 7
100 100 26
777 777 34
456 456 36
84848 84848 152
27485 27485 153
123456 123456 62
654321 654321 186
987654 987654 184
4657 4657 153
9182 9182 172
19293 19293 168
8291 8291 40
918827 918827 83
72683 734890 509
90234 295737 443
29478 23848 308
62549 823647 509
981234 638347 525
8374 234555 443
555 5555 238
737 93782 351
21453 627428 509
6264 23556 282
