1 10 20
177 377 144
100 200 125
201 210 89
900 1000 174
25 45 112
60 65 108
89 100 119
95 145 122
87 205 125
76 350 144
80 888 179
90 987 179
21 7650 262
123 7653 262
876 23723 282
39 3434 217
234 1231 182
3434 23472 279
243 34121 308
488 9834 262
3847 38471 324
2349 23411 279
2323 12321 268
347 23413 279
121 23332 279
384 12314 268
442 23411 279
7878 21231 279
898 8889 262
888 89989 351
665 67666 340
666 34238 308
777 23421 279
429 2324 183
23 341 144
782 8329 262
834 89371 351
112 12321 268
747 74748 340
232 23443 279
7473 29487 308
790 84394 351
211 34321 311
293 89342 351
389 83981 351
832 32781 308
842 72921 340
832 28931 308
892 78322 351
894 23749 282
479 18913 279
329 18921 279
948 13782 276
891 74291 340
89 42720 324
900 67797 340
767 7889 262
786 67464 340
6764 7678 257
674 679 114
768 68786 340
746 72832 340
283 74229 340
894 23781 282
873 7823 262
7813 98938 351
8912 78920 351
928 9318 262
904 2392 183
890 89678 351
875 8789 262
676 67899 340
876 78564 351
7687 56675 340
797 76567 340
655 8780 262
8765 76756 340
544 78789 351
786 67890 340
6754 87764 351
989 67545 340
786 67545 340
757 88765 351
888 67578 340
987 9879 262
998 8976 262
98 98979 351
898 87888 351
98 8987 262
989 78768 351
878 87888 351
898 89088 351
767 98909 351
898 89899 351
1 999999 525
1 1 1
1 2 2
999999 999999 259
2 2 2
8999999 900000 686
