....................
----------------------------------------------------------------------
Ran 20 tests in 0.698s

OK
Name             Stmts   Miss Branch BrPart  Cover   Missing
------------------------------------------------------------
Collatz.py          37      0     12      0   100%
TestCollatz.py      85      0      2      0   100%
------------------------------------------------------------
TOTAL              122      0     14      0   100%
