1 45 112
10 27 112
63 8 113
5 92 116
37 20 112
12 56 113
3 71 113
9 34 112
17 78 116
6 29 112
14 63 113
41 13 112
8 55 113
28 91 116
11 37 112
53 2 112
7 65 113
19 47 112
2 76 116
59 23 113
31 84 116
6 69 113
15 39 112
15 60 113
46 24 112
73 18 116
12 49 112
35 5 112
1 57 113
81 10 116
9 29 112
68 7 113
52 3 112
5 66 113
42 12 112
16 61 113
25 98 119
13 44 112
38 16 112
3 70 113
62 11 113
19 75 116
49 21 112
8 36 112
95 1 116
21 58 113
2 67 113
84 9 116
14 53 112
57 4 113
11 35 112
33 6 112
7 68 113
70 2 113
10 45 112
55 15 113
21 80 116
87 1 116
34 8 112
6 54 113
31 65 113
54 23 113
10 33 112
88 22 116
17 99 119
78 39 116
6 89 116
59 41 113
8 62 113
37 74 116
92 19 116
27 81 116
4 77 116
48 12 112
15 52 112
70 29 113
94 38 116
11 86 116
45 7 112
32 73 116
67 4 113
9 58 113
62 14 113
50 35 110
20 71 113
84 26 116
5 49 112
36 66 113
74 18 116
13 75 116
68 1 113
26 64 113
3 29 112
56 45 113
81 38 116
7 39 112
46 27 112
24 78 116
70 5 113
19 94 116
18087 512635 470
237107 621886 470
391065 678919 509
552233 746523 509
424228 591252 470
977326 293660 525
738949 491891 509
652915 173509 509
963564 161571 525
120993 585484 470
264304 982327 525
112301 225447 386
118755 923707 525
929531 217972 525
286507 414256 449
332441 475272 449
607616 441736 470
6803 146393 375
579913 747424 509
5872 895892 525
55476 413554 449
14179 948866 525
1576 383697 443
53474 973362 525
374186 227200 443
676930 811535 504
648758 195860 509
984640 628613 525
937272 218186 525
153695 931090 525
166984 795790 509
439952 13337 449
951242 498014 525
256267 605750 470
212019 29568 383
647444 259660 509
158804 292016 443
889883 73674 525
977068 469153 525
407416 56311 443
137764 792487 509
781760 261057 509
107073 360831 443
857961 416542 525
798255 384968 509
44487 468400 449
823001 983827 525
979568 557821 525
889158 401855 525
488760 929223 525
10124 719556 509
941045 95198 525
778625 982185 525
203531 283393 443
498523 196147 449
322951 307137 384
755154 667074 504
948455 78159 525
275488 532032 470
475576 244985 449
717619 648384 504
200377 867735 525
906753 269461 525
978534 234799 525
504327 588305 470
121648 597108 470
162493 935038 525
964238 784138 525
653202 532016 509
83342 109745 354
413486 440164 418
38789 796440 509
482151 135795 449
23177 129157 354
380437 524911 470
348043 858540 525
89884 306462 443
487406 926699 525
158167 180768 370
768919 925596 525
227191 375933 443
178087 978595 525
825274 81855 509
98040 924642 525
500860 909439 525
209938 713576 509
50206 489448 449
85820 975962 525
245256 171653 443
198734 824101 509
167160 892218 525
223769 920434 525
81816 260699 443
929050 138019 525
135057 228717 386
166949 843549 525
69468 12439 340
241597 804319 509
723148 631839 504
1 999999 525
