<?xml version="1.0" encoding="UTF-8"?><svg xmlns="http://www.w3.org/2000/svg" xmlns:xlink="http://www.w3.org/1999/xlink" fill-opacity="1" color-rendering="auto" color-interpolation="auto" stroke="black" text-rendering="auto" stroke-linecap="square" width="646" stroke-miterlimit="10" stroke-opacity="1" shape-rendering="auto" fill="black" stroke-dasharray="none" font-weight="normal" stroke-width="1" height="247" font-family="'Dialog'" font-style="normal" stroke-linejoin="miter" font-size="12" stroke-dashoffset="0" image-rendering="auto">
  <!--Generated by ySVG 2.5-->
  <defs id="genericDefs"/>
  <g>
    <defs id="defs1">
      <linearGradient x1="322.5" gradientUnits="userSpaceOnUse" x2="457.5" y1="70" y2="110" id="linearGradient1" spreadMethod="reflect">
        <stop stop-opacity="1" stop-color="rgb(232,238,247)" offset="0%"/>
        <stop stop-opacity="1" stop-color="rgb(183,201,227)" offset="100%"/>
      </linearGradient>
      <linearGradient x1="82.5" gradientUnits="userSpaceOnUse" x2="697.5" y1="155" y2="286.5" id="linearGradient2" spreadMethod="reflect">
        <stop stop-opacity="0.902" stop-color="rgb(255,255,255)" offset="0%"/>
        <stop stop-opacity="0.8" stop-color="rgb(212,212,212)" offset="100%"/>
      </linearGradient>
      <linearGradient x1="127.5" gradientUnits="userSpaceOnUse" x2="262.5" y1="200" y2="240" id="linearGradient3" spreadMethod="reflect">
        <stop stop-opacity="1" stop-color="rgb(232,238,247)" offset="0%"/>
        <stop stop-opacity="1" stop-color="rgb(183,201,227)" offset="100%"/>
      </linearGradient>
      <linearGradient x1="312.5" gradientUnits="userSpaceOnUse" x2="447.5" y1="200" y2="240" id="linearGradient4" spreadMethod="reflect">
        <stop stop-opacity="1" stop-color="rgb(232,238,247)" offset="0%"/>
        <stop stop-opacity="1" stop-color="rgb(183,201,227)" offset="100%"/>
      </linearGradient>
      <linearGradient x1="497.5" gradientUnits="userSpaceOnUse" x2="632.5" y1="200" y2="240" id="linearGradient5" spreadMethod="reflect">
        <stop stop-opacity="1" stop-color="rgb(232,238,247)" offset="0%"/>
        <stop stop-opacity="1" stop-color="rgb(183,201,227)" offset="100%"/>
      </linearGradient>
      <clipPath clipPathUnits="userSpaceOnUse" id="clipPath1">
        <path d="M0 0 L646 0 L646 247 L0 247 L0 0 Z"/>
      </clipPath>
      <clipPath clipPathUnits="userSpaceOnUse" id="clipPath2">
        <path d="M67 55 L713 55 L713 302 L67 302 L67 55 Z"/>
      </clipPath>
      <clipPath clipPathUnits="userSpaceOnUse" id="clipPath3">
        <path d="M2.7273 -32.3896 L271.1948 -32.3896 L271.1948 70.2597 L2.7273 70.2597 L2.7273 -32.3896 Z"/>
      </clipPath>
    </defs>
    <g fill="white" text-rendering="geometricPrecision" shape-rendering="geometricPrecision" transform="translate(-67,-55)" stroke="white">
      <rect x="67" width="646" height="247" y="55" clip-path="url(#clipPath2)" stroke="none"/>
    </g>
    <g fill="url(#linearGradient1)" text-rendering="geometricPrecision" shape-rendering="geometricPrecision" transform="matrix(1,0,0,1,-67,-55)" stroke="url(#linearGradient1)">
      <rect x="322.5" y="70" clip-path="url(#clipPath2)" width="135" rx="20" ry="20" height="40" stroke="none"/>
    </g>
    <g text-rendering="geometricPrecision" stroke-miterlimit="1.45" shape-rendering="geometricPrecision" transform="matrix(1,0,0,1,-67,-55)" stroke-linecap="butt">
      <rect x="322.5" y="70" clip-path="url(#clipPath2)" fill="none" width="135" rx="20" ry="20" height="40"/>
      <text x="379.0635" xml:space="preserve" y="94.1543" font-family="sans-serif" clip-path="url(#clipPath2)" stroke="none">Idle</text>
    </g>
    <g text-rendering="geometricPrecision" shape-rendering="geometricPrecision" transform="matrix(2.4062,0,0,2.4062,-6.5625,77.9375)" image-rendering="optimizeQuality">
      <image x="0" y="0" clip-path="url(#clipPath3)" width="276" xlink:href="data:image/png;base64,iVBORw0KGgoAAAANSUhEUgAAARQAAABKCAYAAAB6g6tKAAACQ0lEQVR42u3a4W6b&#10;MBSAUSAkqvb+D7umAa9o15KH1gEhP1b7HMlKkxIqofDFhnYdAAAAAAAA309/Yvve&#10;4YNqpY3np4LS/2WICtQfkxRj3hOVPUFYthk+xyXGsIoKUGdUckiWMRU/f2ncGZMx&#10;xq0Ii6BA3UHJIfn4HI94TP+aqewJyiW2e4txi+eCAnUHJcfkPcZcvH44KH0xQ7lG&#10;TH7E4xihSY47VCnPTu7RgBSzlCm6kM4ueW7FLOUqKFD9DOUR5/8cYcnXUJ+aoZRB&#10;uRRLn6ugQBNB6SMm+Rrq5s2YcefOc1jKIShQ95KnPN933dkdT/zBJChAaXAIAEEB&#10;BAUQFABBAQQFEBRAUAAEBRAUQFAABAUQFEBQAEEBEBRAUABBARAUQFAAQQEEBUBQ&#10;AEEBBAVAUABBAQQFEBQAQQEEBRAUAEEBBAUQFEBQAA4aHQJCf/L9ySHEDAUQFEBQ&#10;gIq5hsKW9bUV10oQFE6HZP26sGDJw6mYHN0GQQEQFF4nvWgbGjMe+IB9NWg3KgJT&#10;rznGoXN93PlBWcYU4xHrZ0GpS7/z9SQozXyh5PN9WgXm6aCk2Ene8T0+YMtrFx+i&#10;JoKy/p2gtBOUfM5/xM+ngpKKoCw7fO9+X3OZ4n2C0k5QLHnanaEs5/7PeJy2ViZb&#10;M5S52Gle5twjJm4bth0ZAak/KHPMTPKEIi99nl7ydMVOc7GGGIICdQdlfclj2voi&#10;2fsPTHkMq+dAnTEpJxSp+/OOz0vWzf0L19vA94qLJS4AAAAAwP/mFw2HllVbiBZQ&#10;AAAAAElFTkSuQmCC" height="74" preserveAspectRatio="none"/>
      <rect x="82.5" y="155" transform="matrix(0.4156,0,0,0.4156,-25.1169,-55.2468)" clip-path="url(#clipPath2)" fill="url(#linearGradient2)" width="615" image-rendering="auto" rx="4" ry="4" height="131.5" stroke="none"/>
    </g>
    <g stroke-linecap="butt" transform="matrix(1,0,0,1,-67,-55)" fill="rgb(18,62,162)" text-rendering="geometricPrecision" shape-rendering="geometricPrecision" stroke="rgb(18,62,162)" stroke-miterlimit="1.45">
      <rect x="82.5" y="155" clip-path="url(#clipPath2)" fill="none" width="615" rx="4" ry="4" height="131.5"/>
    </g>
    <g stroke-linecap="butt" transform="matrix(1,0,0,1,-67,-55)" fill-opacity="0" fill="rgb(0,0,0)" text-rendering="geometricPrecision" shape-rendering="geometricPrecision" stroke="rgb(0,0,0)" stroke-opacity="0" stroke-miterlimit="1.45">
      <path d="M382.5 267.5 L397.5 267.5 L397.5 282.5 L382.5 282.5 Z" clip-path="url(#clipPath2)" stroke="none"/>
    </g>
    <g text-rendering="geometricPrecision" shape-rendering="geometricPrecision" transform="matrix(1,0,0,1,-67,-55)" stroke-linecap="butt">
      <path fill="none" d="M382.5 267.5 L397.5 267.5 L397.5 282.5 L382.5 282.5 Z" clip-path="url(#clipPath2)"/>
      <path fill="none" d="M386.16 275 L393.84 275" clip-path="url(#clipPath2)"/>
      <text x="363.3984" y="172.1387" clip-path="url(#clipPath2)" font-family="sans-serif" stroke="none" xml:space="preserve" stroke-miterlimit="1.45">Transmit</text>
    </g>
    <g fill="url(#linearGradient3)" text-rendering="geometricPrecision" shape-rendering="geometricPrecision" transform="matrix(1,0,0,1,-67,-55)" stroke="url(#linearGradient3)">
      <rect x="127.5" y="200" clip-path="url(#clipPath2)" width="135" rx="20" ry="20" height="40" stroke="none"/>
    </g>
    <g text-rendering="geometricPrecision" stroke-miterlimit="1.45" shape-rendering="geometricPrecision" transform="matrix(1,0,0,1,-67,-55)" stroke-linecap="butt">
      <rect x="127.5" y="200" clip-path="url(#clipPath2)" fill="none" width="135" rx="20" ry="20" height="40"/>
      <text x="168.3984" xml:space="preserve" y="217.1699" font-family="sans-serif" clip-path="url(#clipPath2)" stroke="none">Transmit</text>
      <text x="135.0352" xml:space="preserve" y="231.1387" font-family="sans-serif" clip-path="url(#clipPath2)" stroke="none">Identify Namespace</text>
    </g>
    <g fill="url(#linearGradient4)" text-rendering="geometricPrecision" shape-rendering="geometricPrecision" transform="matrix(1,0,0,1,-67,-55)" stroke="url(#linearGradient4)">
      <rect x="312.5" y="200" clip-path="url(#clipPath2)" width="135" rx="20" ry="20" height="40" stroke="none"/>
    </g>
    <g text-rendering="geometricPrecision" stroke-miterlimit="1.45" shape-rendering="geometricPrecision" transform="matrix(1,0,0,1,-67,-55)" stroke-linecap="butt">
      <rect x="312.5" y="200" clip-path="url(#clipPath2)" fill="none" width="135" rx="20" ry="20" height="40"/>
      <text x="353.3984" xml:space="preserve" y="217.1699" font-family="sans-serif" clip-path="url(#clipPath2)" stroke="none">Transmit</text>
      <text x="325.6924" xml:space="preserve" y="231.1387" font-family="sans-serif" clip-path="url(#clipPath2)" stroke="none">Identify Controller</text>
    </g>
    <g fill="url(#linearGradient5)" text-rendering="geometricPrecision" shape-rendering="geometricPrecision" transform="matrix(1,0,0,1,-67,-55)" stroke="url(#linearGradient5)">
      <rect x="497.5" y="200" clip-path="url(#clipPath2)" width="135" rx="20" ry="20" height="40" stroke="none"/>
    </g>
    <g text-rendering="geometricPrecision" stroke-miterlimit="1.45" shape-rendering="geometricPrecision" transform="matrix(1,0,0,1,-67,-55)" stroke-linecap="butt">
      <rect x="497.5" y="200" clip-path="url(#clipPath2)" fill="none" width="135" rx="20" ry="20" height="40"/>
      <text x="538.3984" xml:space="preserve" y="217.1699" font-family="sans-serif" clip-path="url(#clipPath2)" stroke="none">Transmit</text>
      <text x="515.7578" xml:space="preserve" y="231.1387" font-family="sans-serif" clip-path="url(#clipPath2)" stroke="none">LBA Range Type</text>
    </g>
    <g text-rendering="geometricPrecision" stroke-miterlimit="1.45" shape-rendering="geometricPrecision" transform="matrix(1,0,0,1,-67,-55)" stroke-linecap="butt">
      <path fill="none" d="M360 110.0147 L360 146.9739" clip-path="url(#clipPath2)"/>
    </g>
    <g text-rendering="geometricPrecision" stroke-miterlimit="1.45" shape-rendering="geometricPrecision" transform="matrix(1,0,0,1,-67,-55)" stroke-linecap="butt">
      <path d="M360 154.9739 L365 142.9739 L360 145.9739 L355 142.9739 Z" clip-path="url(#clipPath2)" stroke="none"/>
      <path fill="none" d="M418 155.0239 L418 117.9707" clip-path="url(#clipPath2)"/>
      <path d="M418 109.9707 L413 121.9707 L418 118.9707 L423 121.9707 Z" clip-path="url(#clipPath2)" stroke="none"/>
    </g>
  </g>
</svg>
