 
=======
VC0stats: 
avg_lat is: 26.46942113497369
min_lat is:5
max_lat is:147
total packets: 14062
95% avg_lat: 24.595962242400198
95% latency stopper is: 51
======
 
=======
VC1stats: 
avg_lat is: 27.224743777452417
min_lat is:5
max_lat is:133
total packets: 5464
95% avg_lat: 25.33559374277568
95% latency stopper is: 52
======
 
=======
VC2stats: 
avg_lat is: 28.52728670253651
min_lat is:5
max_lat is:103
total packets: 1301
95% avg_lat: 26.640236255511955
95% latency stopper is: 53
======
 
=======
VC3stats: 
avg_lat is: 27.850299401197606
min_lat is:5
max_lat is:83
total packets: 167
95% avg_lat: 25.729593444689566
95% latency stopper is: 52
======
 
=======
VC4stats: 
avg_lat is: 20.337716214315847
min_lat is:5
max_lat is:91
total packets: 14222
95% avg_lat: 19.062016594009282
95% latency stopper is: 37
======
 
=======
VC5stats: 
avg_lat is: 20.90392618056812
min_lat is:5
max_lat is:75
total packets: 5527
95% avg_lat: 19.632236008875093
95% latency stopper is: 38
======
 
=======
VC6stats: 
avg_lat is: 21.37864768683274
min_lat is:5
max_lat is:74
total packets: 1405
95% avg_lat: 20.110882187675596
95% latency stopper is: 38
======
 
=======
VC7stats: 
avg_lat is: 22.58823529411765
min_lat is:6
max_lat is:79
total packets: 187
95% avg_lat: 20.990712074303406
95% latency stopper is: 41
======
 
=======
VC8stats: 
avg_lat is: 1549.7409836065574
min_lat is:13
max_lat is:5127
total packets: 4575
95% avg_lat: 1402.2343399482313
95% latency stopper is: 3946
======
 
=======
VC9stats: 
avg_lat is: 1551.8581809070408
min_lat is:15
max_lat is:4976
total packets: 3991
95% avg_lat: 1405.2826754935447
95% latency stopper is: 3948
======
 
=======
VC10stats: 
avg_lat is: 1528.283273381295
min_lat is:13
max_lat is:5066
total packets: 3336
95% avg_lat: 1382.1822541966428
95% latency stopper is: 3870
======
 
=======
VC11stats: 
avg_lat is: 1558.0959454034523
min_lat is:24
max_lat is:5024
total packets: 2491
95% avg_lat: 1408.6027594075515
95% latency stopper is: 3931
======
total latency is: 23264875
total packets are: 56728
Average latency of network is: 410.1127309265266
