 
=======
VC0stats: 
avg_lat is: 17.125978647686832
max_lat is:96
total packets: 9835
95% avg_lat: 15.863002702485751
95% latency stopper is: 33
======
 
=======
VC1stats: 
avg_lat is: 17.848373983739837
max_lat is:69
total packets: 2460
95% avg_lat: 16.554557124518613
95% latency stopper is: 36
======
 
=======
VC2stats: 
avg_lat is: 18.518617021276597
max_lat is:55
total packets: 376
95% avg_lat: 17.28723404255319
95% latency stopper is: 36
======
 
=======
VC3stats: 
avg_lat is: 19.48148148148148
max_lat is:38
total packets: 27
95% avg_lat: 17.73879142300195
95% latency stopper is: 33
======
 
=======
VC4stats: 
avg_lat is: 14.090945795901888
max_lat is:55
total packets: 9907
95% avg_lat: 13.29012447339202
95% latency stopper is: 25
======
 
=======
VC5stats: 
avg_lat is: 14.465721040189125
max_lat is:42
total packets: 2538
95% avg_lat: 13.66139936128738
95% latency stopper is: 26
======
 
=======
VC6stats: 
avg_lat is: 14.888
max_lat is:36
total packets: 375
95% avg_lat: 14.015438596491228
95% latency stopper is: 27
======
 
=======
VC7stats: 
avg_lat is: 17.424242424242426
max_lat is:32
total packets: 33
95% avg_lat: 16.427432216905903
95% latency stopper is: 28
======
 
=======
VC8stats: 
avg_lat is: 32.51834532374101
max_lat is:366
total packets: 5560
95% avg_lat: 29.30367285119273
95% latency stopper is: 72
======
 
=======
VC9stats: 
avg_lat is: 33.92578423871461
max_lat is:244
total packets: 3921
95% avg_lat: 30.70484167572719
95% latency stopper is: 75
======
 
=======
VC10stats: 
avg_lat is: 35.85789705235372
max_lat is:235
total packets: 2273
95% avg_lat: 32.82561882047838
95% latency stopper is: 75
======
 
=======
VC11stats: 
avg_lat is: 36.878116343490305
max_lat is:173
total packets: 1083
95% avg_lat: 33.91942460028187
95% latency stopper is: 76
======
