%!PS-Adobe-3.0 EPSF-3.0
%%Title: VNET0_0.24.eps
%%Creator: matplotlib version 3.0.3, http://matplotlib.org/
%%CreationDate: Fri Aug  9 22:35:54 2019
%%Orientation: portrait
%%BoundingBox: 75 223 536 568
%%EndComments
%%BeginProlog
/mpldict 8 dict def
mpldict begin
/m { moveto } bind def
/l { lineto } bind def
/r { rlineto } bind def
/c { curveto } bind def
/cl { closepath } bind def
/box {
m
1 index 0 r
0 exch r
neg 0 r
cl
} bind def
/clipbox {
box
clip
newpath
} bind def
%!PS-Adobe-3.0 Resource-Font
%%Title: DejaVu Sans
%%Copyright: Copyright (c) 2003 by Bitstream, Inc. All Rights Reserved. Copyright (c) 2006 by Tavmjong Bah. All Rights Reserved. DejaVu changes are in public domain 
%%Creator: Converted from TrueType to type 3 by PPR
25 dict begin
/_d{bind def}bind def
/_m{moveto}_d
/_l{lineto}_d
/_cl{closepath eofill}_d
/_c{curveto}_d
/_sc{7 -1 roll{setcachedevice}{pop pop pop pop pop pop}ifelse}_d
/_e{exec}_d
/FontName /DejaVuSans def
/PaintType 0 def
/FontMatrix[.001 0 0 .001 0 0]def
/FontBBox[-1021 -463 1793 1232]def
/FontType 3 def
/Encoding [ /space /period /zero /one /two /three /four /five /six /seven /eight /equal /L /N /S /a /b /c /e /f /h /i /j /k /l /m /n /o /p /r /s /t /u /y ] def
/FontInfo 10 dict dup begin
/FamilyName (DejaVu Sans) def
/FullName (DejaVu Sans) def
/Notice (Copyright (c) 2003 by Bitstream, Inc. All Rights Reserved. Copyright (c) 2006 by Tavmjong Bah. All Rights Reserved. DejaVu changes are in public domain ) def
/Weight (Book) def
/Version (Version 2.35) def
/ItalicAngle 0.0 def
/isFixedPitch false def
/UnderlinePosition -130 def
/UnderlineThickness 90 def
end readonly def
/CharStrings 35 dict dup begin
/.notdef 0 def
/space{318 0 0 0 0 0 _sc
}_d
/period{318 0 107 0 210 124 _sc
107 124 _m
210 124 _l
210 0 _l
107 0 _l
107 124 _l
_cl}_d
/zero{636 0 66 -13 570 742 _sc
318 664 _m
267 664 229 639 203 589 _c
177 539 165 464 165 364 _c
165 264 177 189 203 139 _c
229 89 267 64 318 64 _c
369 64 407 89 433 139 _c
458 189 471 264 471 364 _c
471 464 458 539 433 589 _c
407 639 369 664 318 664 _c
318 742 _m
399 742 461 709 505 645 _c
548 580 570 486 570 364 _c
570 241 548 147 505 83 _c
461 19 399 -13 318 -13 _c
236 -13 173 19 130 83 _c
87 147 66 241 66 364 _c
66 486 87 580 130 645 _c
173 709 236 742 318 742 _c
_cl}_d
/one{636 0 110 0 544 729 _sc
124 83 _m
285 83 _l
285 639 _l
110 604 _l
110 694 _l
284 729 _l
383 729 _l
383 83 _l
544 83 _l
544 0 _l
124 0 _l
124 83 _l
_cl}_d
/two{{636 0 73 0 536 742 _sc
192 83 _m
536 83 _l
536 0 _l
73 0 _l
73 83 _l
110 121 161 173 226 239 _c
290 304 331 346 348 365 _c
380 400 402 430 414 455 _c
426 479 433 504 433 528 _c
433 566 419 598 392 622 _c
365 646 330 659 286 659 _c
255 659 222 653 188 643 _c
154 632 117 616 78 594 _c
78 694 _l
118 710 155 722 189 730 _c
223 738 255 742 284 742 _c
}_e{359 742 419 723 464 685 _c
509 647 532 597 532 534 _c
532 504 526 475 515 449 _c
504 422 484 390 454 354 _c
446 344 420 317 376 272 _c
332 227 271 164 192 83 _c
_cl}_e}_d
/three{{636 0 76 -13 556 742 _sc
406 393 _m
453 383 490 362 516 330 _c
542 298 556 258 556 212 _c
556 140 531 84 482 45 _c
432 6 362 -13 271 -13 _c
240 -13 208 -10 176 -4 _c
144 1 110 10 76 22 _c
76 117 _l
103 101 133 89 166 81 _c
198 73 232 69 268 69 _c
330 69 377 81 409 105 _c
441 129 458 165 458 212 _c
458 254 443 288 413 312 _c
383 336 341 349 287 349 _c
}_e{202 349 _l
202 430 _l
291 430 _l
339 430 376 439 402 459 _c
428 478 441 506 441 543 _c
441 580 427 609 401 629 _c
374 649 336 659 287 659 _c
260 659 231 656 200 650 _c
169 644 135 635 98 623 _c
98 711 _l
135 721 170 729 203 734 _c
235 739 266 742 296 742 _c
370 742 429 725 473 691 _c
517 657 539 611 539 553 _c
539 513 527 479 504 451 _c
481 423 448 403 406 393 _c
_cl}_e}_d
/four{636 0 49 0 580 729 _sc
378 643 _m
129 254 _l
378 254 _l
378 643 _l
352 729 _m
476 729 _l
476 254 _l
580 254 _l
580 172 _l
476 172 _l
476 0 _l
378 0 _l
378 172 _l
49 172 _l
49 267 _l
352 729 _l
_cl}_d
/five{{636 0 77 -13 549 729 _sc
108 729 _m
495 729 _l
495 646 _l
198 646 _l
198 467 _l
212 472 227 476 241 478 _c
255 480 270 482 284 482 _c
365 482 429 459 477 415 _c
525 370 549 310 549 234 _c
549 155 524 94 475 51 _c
426 8 357 -13 269 -13 _c
238 -13 207 -10 175 -6 _c
143 -1 111 6 77 17 _c
77 116 _l
106 100 136 88 168 80 _c
199 72 232 69 267 69 _c
}_e{323 69 368 83 401 113 _c
433 143 450 183 450 234 _c
450 284 433 324 401 354 _c
368 384 323 399 267 399 _c
241 399 214 396 188 390 _c
162 384 135 375 108 363 _c
108 729 _l
_cl}_e}_d
/six{{636 0 70 -13 573 742 _sc
330 404 _m
286 404 251 388 225 358 _c
199 328 186 286 186 234 _c
186 181 199 139 225 109 _c
251 79 286 64 330 64 _c
374 64 409 79 435 109 _c
461 139 474 181 474 234 _c
474 286 461 328 435 358 _c
409 388 374 404 330 404 _c
526 713 _m
526 623 _l
501 635 476 644 451 650 _c
425 656 400 659 376 659 _c
310 659 260 637 226 593 _c
}_e{192 549 172 482 168 394 _c
187 422 211 444 240 459 _c
269 474 301 482 336 482 _c
409 482 467 459 509 415 _c
551 371 573 310 573 234 _c
573 159 550 99 506 54 _c
462 9 403 -13 330 -13 _c
246 -13 181 19 137 83 _c
92 147 70 241 70 364 _c
70 479 97 571 152 639 _c
206 707 280 742 372 742 _c
396 742 421 739 447 735 _c
472 730 498 723 526 713 _c
_cl}_e}_d
/seven{636 0 82 0 551 729 _sc
82 729 _m
551 729 _l
551 687 _l
286 0 _l
183 0 _l
432 646 _l
82 646 _l
82 729 _l
_cl}_d
/eight{{636 0 68 -13 568 742 _sc
318 346 _m
271 346 234 333 207 308 _c
180 283 167 249 167 205 _c
167 161 180 126 207 101 _c
234 76 271 64 318 64 _c
364 64 401 76 428 102 _c
455 127 469 161 469 205 _c
469 249 455 283 429 308 _c
402 333 365 346 318 346 _c
219 388 _m
177 398 144 418 120 447 _c
96 476 85 511 85 553 _c
85 611 105 657 147 691 _c
188 725 245 742 318 742 _c
}_e{390 742 447 725 489 691 _c
530 657 551 611 551 553 _c
551 511 539 476 515 447 _c
491 418 459 398 417 388 _c
464 377 501 355 528 323 _c
554 291 568 251 568 205 _c
568 134 546 80 503 43 _c
459 5 398 -13 318 -13 _c
237 -13 175 5 132 43 _c
89 80 68 134 68 205 _c
68 251 81 291 108 323 _c
134 355 171 377 219 388 _c
183 544 _m
183 506 194 476 218 455 _c
}_e{242 434 275 424 318 424 _c
360 424 393 434 417 455 _c
441 476 453 506 453 544 _c
453 582 441 611 417 632 _c
393 653 360 664 318 664 _c
275 664 242 653 218 632 _c
194 611 183 582 183 544 _c
_cl}_e}_d
/equal{838 0 106 172 732 454 _sc
106 454 _m
732 454 _l
732 372 _l
106 372 _l
106 454 _l
106 255 _m
732 255 _l
732 172 _l
106 172 _l
106 255 _l
_cl}_d
/L{557 0 98 0 552 729 _sc
98 729 _m
197 729 _l
197 83 _l
552 83 _l
552 0 _l
98 0 _l
98 729 _l
_cl}_d
/N{748 0 98 0 650 729 _sc
98 729 _m
231 729 _l
554 119 _l
554 729 _l
650 729 _l
650 0 _l
517 0 _l
194 610 _l
194 0 _l
98 0 _l
98 729 _l
_cl}_d
/S{{635 0 66 -13 579 742 _sc
535 705 _m
535 609 _l
497 627 462 640 429 649 _c
395 657 363 662 333 662 _c
279 662 237 651 208 631 _c
179 610 165 580 165 542 _c
165 510 174 485 194 469 _c
213 452 250 439 304 429 _c
364 417 _l
437 403 491 378 526 343 _c
561 307 579 260 579 201 _c
579 130 555 77 508 41 _c
460 5 391 -13 300 -13 _c
265 -13 228 -9 189 -2 _c
}_e{150 5 110 16 69 32 _c
69 134 _l
109 111 148 94 186 83 _c
224 71 262 66 300 66 _c
356 66 399 77 430 99 _c
460 121 476 152 476 194 _c
476 230 465 258 443 278 _c
421 298 385 313 335 323 _c
275 335 _l
201 349 148 372 115 404 _c
82 435 66 478 66 534 _c
66 598 88 649 134 686 _c
179 723 242 742 322 742 _c
356 742 390 739 426 733 _c
461 727 497 717 535 705 _c
}_e{_cl}_e}_d
/a{{613 0 60 -13 522 560 _sc
343 275 _m
270 275 220 266 192 250 _c
164 233 150 205 150 165 _c
150 133 160 107 181 89 _c
202 70 231 61 267 61 _c
317 61 357 78 387 114 _c
417 149 432 196 432 255 _c
432 275 _l
343 275 _l
522 312 _m
522 0 _l
432 0 _l
432 83 _l
411 49 385 25 355 10 _c
325 -5 287 -13 243 -13 _c
187 -13 142 2 109 33 _c
76 64 60 106 60 159 _c
}_e{60 220 80 266 122 298 _c
163 329 224 345 306 345 _c
432 345 _l
432 354 _l
432 395 418 427 391 450 _c
364 472 326 484 277 484 _c
245 484 215 480 185 472 _c
155 464 127 453 100 439 _c
100 522 _l
132 534 164 544 195 550 _c
226 556 256 560 286 560 _c
365 560 424 539 463 498 _c
502 457 522 395 522 312 _c
_cl}_e}_d
/b{{635 0 91 -13 580 760 _sc
487 273 _m
487 339 473 390 446 428 _c
418 466 381 485 334 485 _c
286 485 249 466 222 428 _c
194 390 181 339 181 273 _c
181 207 194 155 222 117 _c
249 79 286 61 334 61 _c
381 61 418 79 446 117 _c
473 155 487 207 487 273 _c
181 464 _m
199 496 223 520 252 536 _c
281 552 316 560 356 560 _c
422 560 476 533 518 481 _c
559 428 580 359 580 273 _c
}_e{580 187 559 117 518 65 _c
476 13 422 -13 356 -13 _c
316 -13 281 -5 252 10 _c
223 25 199 49 181 82 _c
181 0 _l
91 0 _l
91 760 _l
181 760 _l
181 464 _l
_cl}_e}_d
/c{{550 0 55 -13 488 560 _sc
488 526 _m
488 442 _l
462 456 437 466 411 473 _c
385 480 360 484 334 484 _c
276 484 230 465 198 428 _c
166 391 150 339 150 273 _c
150 206 166 154 198 117 _c
230 80 276 62 334 62 _c
360 62 385 65 411 72 _c
437 79 462 90 488 104 _c
488 21 _l
462 9 436 0 410 -5 _c
383 -10 354 -13 324 -13 _c
242 -13 176 12 128 64 _c
}_e{79 115 55 185 55 273 _c
55 362 79 432 128 483 _c
177 534 244 560 330 560 _c
358 560 385 557 411 551 _c
437 545 463 537 488 526 _c
_cl}_e}_d
/e{{615 0 55 -13 562 560 _sc
562 296 _m
562 252 _l
149 252 _l
153 190 171 142 205 110 _c
238 78 284 62 344 62 _c
378 62 412 66 444 74 _c
476 82 509 95 541 113 _c
541 28 _l
509 14 476 3 442 -3 _c
408 -9 373 -13 339 -13 _c
251 -13 182 12 131 62 _c
80 112 55 181 55 268 _c
55 357 79 428 127 481 _c
175 533 241 560 323 560 _c
397 560 455 536 498 489 _c
}_e{540 441 562 377 562 296 _c
472 322 _m
471 371 457 410 431 440 _c
404 469 368 484 324 484 _c
274 484 234 469 204 441 _c
174 413 156 373 152 322 _c
472 322 _l
_cl}_e}_d
/f{352 0 23 0 371 760 _sc
371 760 _m
371 685 _l
285 685 _l
253 685 230 678 218 665 _c
205 652 199 629 199 595 _c
199 547 _l
347 547 _l
347 477 _l
199 477 _l
199 0 _l
109 0 _l
109 477 _l
23 477 _l
23 547 _l
109 547 _l
109 585 _l
109 645 123 690 151 718 _c
179 746 224 760 286 760 _c
371 760 _l
_cl}_d
/h{634 0 91 0 549 760 _sc
549 330 _m
549 0 _l
459 0 _l
459 327 _l
459 379 448 417 428 443 _c
408 469 378 482 338 482 _c
289 482 251 466 223 435 _c
195 404 181 362 181 309 _c
181 0 _l
91 0 _l
91 760 _l
181 760 _l
181 462 _l
202 494 227 519 257 535 _c
286 551 320 560 358 560 _c
420 560 468 540 500 501 _c
532 462 549 405 549 330 _c
_cl}_d
/i{278 0 94 0 184 760 _sc
94 547 _m
184 547 _l
184 0 _l
94 0 _l
94 547 _l
94 760 _m
184 760 _l
184 646 _l
94 646 _l
94 760 _l
_cl}_d
/j{278 0 -17 -207 184 760 _sc
94 547 _m
184 547 _l
184 -9 _l
184 -78 170 -128 144 -160 _c
117 -191 74 -207 16 -207 _c
-17 -207 _l
-17 -131 _l
6 -131 _l
40 -131 63 -123 75 -107 _c
87 -91 94 -58 94 -9 _c
94 547 _l
94 760 _m
184 760 _l
184 646 _l
94 646 _l
94 760 _l
_cl}_d
/k{579 0 91 0 576 760 _sc
91 760 _m
181 760 _l
181 311 _l
449 547 _l
564 547 _l
274 291 _l
576 0 _l
459 0 _l
181 267 _l
181 0 _l
91 0 _l
91 760 _l
_cl}_d
/l{278 0 94 0 184 760 _sc
94 760 _m
184 760 _l
184 0 _l
94 0 _l
94 760 _l
_cl}_d
/m{{974 0 91 0 889 560 _sc
520 442 _m
542 482 569 511 600 531 _c
631 550 668 560 711 560 _c
767 560 811 540 842 500 _c
873 460 889 403 889 330 _c
889 0 _l
799 0 _l
799 327 _l
799 379 789 418 771 444 _c
752 469 724 482 686 482 _c
639 482 602 466 575 435 _c
548 404 535 362 535 309 _c
535 0 _l
445 0 _l
445 327 _l
445 379 435 418 417 444 _c
398 469 369 482 331 482 _c
}_e{285 482 248 466 221 435 _c
194 404 181 362 181 309 _c
181 0 _l
91 0 _l
91 547 _l
181 547 _l
181 462 _l
201 495 226 520 255 536 _c
283 552 317 560 357 560 _c
397 560 430 550 458 530 _c
486 510 506 480 520 442 _c
_cl}_e}_d
/n{634 0 91 0 549 560 _sc
549 330 _m
549 0 _l
459 0 _l
459 327 _l
459 379 448 417 428 443 _c
408 469 378 482 338 482 _c
289 482 251 466 223 435 _c
195 404 181 362 181 309 _c
181 0 _l
91 0 _l
91 547 _l
181 547 _l
181 462 _l
202 494 227 519 257 535 _c
286 551 320 560 358 560 _c
420 560 468 540 500 501 _c
532 462 549 405 549 330 _c
_cl}_d
/o{612 0 55 -13 557 560 _sc
306 484 _m
258 484 220 465 192 427 _c
164 389 150 338 150 273 _c
150 207 163 156 191 118 _c
219 80 257 62 306 62 _c
354 62 392 80 420 118 _c
448 156 462 207 462 273 _c
462 337 448 389 420 427 _c
392 465 354 484 306 484 _c
306 560 _m
384 560 445 534 490 484 _c
534 433 557 363 557 273 _c
557 183 534 113 490 63 _c
445 12 384 -13 306 -13 _c
227 -13 165 12 121 63 _c
77 113 55 183 55 273 _c
55 363 77 433 121 484 _c
165 534 227 560 306 560 _c
_cl}_d
/p{{635 0 91 -207 580 560 _sc
181 82 _m
181 -207 _l
91 -207 _l
91 547 _l
181 547 _l
181 464 _l
199 496 223 520 252 536 _c
281 552 316 560 356 560 _c
422 560 476 533 518 481 _c
559 428 580 359 580 273 _c
580 187 559 117 518 65 _c
476 13 422 -13 356 -13 _c
316 -13 281 -5 252 10 _c
223 25 199 49 181 82 _c
487 273 _m
487 339 473 390 446 428 _c
418 466 381 485 334 485 _c
}_e{286 485 249 466 222 428 _c
194 390 181 339 181 273 _c
181 207 194 155 222 117 _c
249 79 286 61 334 61 _c
381 61 418 79 446 117 _c
473 155 487 207 487 273 _c
_cl}_e}_d
/r{411 0 91 0 411 560 _sc
411 463 _m
401 469 390 473 378 476 _c
366 478 353 480 339 480 _c
288 480 249 463 222 430 _c
194 397 181 350 181 288 _c
181 0 _l
91 0 _l
91 547 _l
181 547 _l
181 462 _l
199 495 224 520 254 536 _c
284 552 321 560 365 560 _c
371 560 378 559 386 559 _c
393 558 401 557 411 555 _c
411 463 _l
_cl}_d
/s{{521 0 54 -13 472 560 _sc
443 531 _m
443 446 _l
417 458 391 468 364 475 _c
336 481 308 485 279 485 _c
234 485 200 478 178 464 _c
156 450 145 430 145 403 _c
145 382 153 366 169 354 _c
185 342 217 330 265 320 _c
296 313 _l
360 299 405 279 432 255 _c
458 230 472 195 472 151 _c
472 100 452 60 412 31 _c
372 1 316 -13 246 -13 _c
216 -13 186 -10 154 -5 _c
}_e{122 0 89 8 54 20 _c
54 113 _l
87 95 120 82 152 74 _c
184 65 216 61 248 61 _c
290 61 323 68 346 82 _c
368 96 380 117 380 144 _c
380 168 371 187 355 200 _c
339 213 303 226 247 238 _c
216 245 _l
160 257 119 275 95 299 _c
70 323 58 356 58 399 _c
58 450 76 490 112 518 _c
148 546 200 560 268 560 _c
301 560 332 557 362 552 _c
391 547 418 540 443 531 _c
}_e{_cl}_e}_d
/t{392 0 27 0 368 702 _sc
183 702 _m
183 547 _l
368 547 _l
368 477 _l
183 477 _l
183 180 _l
183 135 189 106 201 94 _c
213 81 238 75 276 75 _c
368 75 _l
368 0 _l
276 0 _l
206 0 158 13 132 39 _c
106 65 93 112 93 180 _c
93 477 _l
27 477 _l
27 547 _l
93 547 _l
93 702 _l
183 702 _l
_cl}_d
/u{634 0 85 -13 543 560 _sc
85 216 _m
85 547 _l
175 547 _l
175 219 _l
175 167 185 129 205 103 _c
225 77 255 64 296 64 _c
344 64 383 79 411 110 _c
439 141 453 183 453 237 _c
453 547 _l
543 547 _l
543 0 _l
453 0 _l
453 84 _l
431 50 405 26 377 10 _c
348 -5 315 -13 277 -13 _c
214 -13 166 6 134 45 _c
101 83 85 140 85 216 _c
311 560 _m
311 560 _l
_cl}_d
/y{592 0 30 -207 562 547 _sc
322 -50 _m
296 -114 271 -157 247 -177 _c
223 -197 191 -207 151 -207 _c
79 -207 _l
79 -132 _l
132 -132 _l
156 -132 175 -126 189 -114 _c
203 -102 218 -75 235 -31 _c
251 9 _l
30 547 _l
125 547 _l
296 119 _l
467 547 _l
562 547 _l
322 -50 _l
_cl}_d
end readonly def

/BuildGlyph
 {exch begin
 CharStrings exch
 2 copy known not{pop /.notdef}if
 true 3 1 roll get exec
 end}_d

/BuildChar {
 1 index /Encoding get exch get
 1 index /BuildGlyph get exec
}_d

FontName currentdict end definefont pop
end
%%EndProlog
mpldict begin
75.6 223.2 translate
460.8 345.6 0 0 clipbox
gsave
0 0 m
460.8 0 l
460.8 345.6 l
0 345.6 l
cl
1.000 setgray
fill
grestore
gsave
57.6 183.168 m
219.927273 183.168 l
219.927273 304.128 l
57.6 304.128 l
cl
1.000 setgray
fill
grestore
gsave
162.3 121 57.6 183.2 clipbox
64.978512 183.168 m
66.600163 183.168 l
66.600163 214.860576 l
64.978512 214.860576 l
cl
0.122 0.467 0.706 setrgbcolor
fill
grestore
gsave
162.3 121 57.6 183.2 clipbox
66.600163 183.168 m
68.221815 183.168 l
68.221815 195.492891 l
66.600163 195.492891 l
cl
0.122 0.467 0.706 setrgbcolor
fill
grestore
gsave
162.3 121 57.6 183.2 clipbox
68.221815 183.168 m
69.843466 183.168 l
69.843466 267.17848 l
68.221815 267.17848 l
cl
0.122 0.467 0.706 setrgbcolor
fill
grestore
gsave
162.3 121 57.6 183.2 clipbox
69.843466 183.168 m
71.465117 183.168 l
71.465117 216.243983 l
69.843466 216.243983 l
cl
0.122 0.467 0.706 setrgbcolor
fill
grestore
gsave
162.3 121 57.6 183.2 clipbox
71.465117 183.168 m
73.086768 183.168 l
73.086768 287.300751 l
71.465117 287.300751 l
cl
0.122 0.467 0.706 setrgbcolor
fill
grestore
gsave
162.3 121 57.6 183.2 clipbox
73.086768 183.168 m
74.708419 183.168 l
74.708419 243.912105 l
73.086768 243.912105 l
cl
0.122 0.467 0.706 setrgbcolor
fill
grestore
gsave
162.3 121 57.6 183.2 clipbox
74.708419 183.168 m
76.33007 183.168 l
76.33007 298.368 l
74.708419 298.368 l
cl
0.122 0.467 0.706 setrgbcolor
fill
grestore
gsave
162.3 121 57.6 183.2 clipbox
76.33007 183.168 m
77.951721 183.168 l
77.951721 266.172367 l
76.33007 266.172367 l
cl
0.122 0.467 0.706 setrgbcolor
fill
grestore
gsave
162.3 121 57.6 183.2 clipbox
77.951721 183.168 m
79.573372 183.168 l
79.573372 287.678044 l
77.951721 287.678044 l
cl
0.122 0.467 0.706 setrgbcolor
fill
grestore
gsave
162.3 121 57.6 183.2 clipbox
79.573372 183.168 m
81.195023 183.168 l
81.195023 266.046603 l
79.573372 266.046603 l
cl
0.122 0.467 0.706 setrgbcolor
fill
grestore
gsave
162.3 121 57.6 183.2 clipbox
81.195023 183.168 m
82.816674 183.168 l
82.816674 273.969747 l
81.195023 273.969747 l
cl
0.122 0.467 0.706 setrgbcolor
fill
grestore
gsave
162.3 121 57.6 183.2 clipbox
82.816674 183.168 m
84.438325 183.168 l
84.438325 265.166253 l
82.816674 265.166253 l
cl
0.122 0.467 0.706 setrgbcolor
fill
grestore
gsave
162.3 121 57.6 183.2 clipbox
84.438325 183.168 m
86.059976 183.168 l
86.059976 256.614288 l
84.438325 256.614288 l
cl
0.122 0.467 0.706 setrgbcolor
fill
grestore
gsave
162.3 121 57.6 183.2 clipbox
86.059976 183.168 m
87.681627 183.168 l
87.681627 247.307738 l
86.059976 247.307738 l
cl
0.122 0.467 0.706 setrgbcolor
fill
grestore
gsave
162.3 121 57.6 183.2 clipbox
87.681627 183.168 m
89.303279 183.168 l
89.303279 249.445729 l
87.681627 249.445729 l
cl
0.122 0.467 0.706 setrgbcolor
fill
grestore
gsave
162.3 121 57.6 183.2 clipbox
89.303279 183.168 m
90.92493 183.168 l
90.92493 238.37848 l
89.303279 238.37848 l
cl
0.122 0.467 0.706 setrgbcolor
fill
grestore
gsave
162.3 121 57.6 183.2 clipbox
90.92493 183.168 m
92.546581 183.168 l
92.546581 235.988961 l
90.92493 235.988961 l
cl
0.122 0.467 0.706 setrgbcolor
fill
grestore
gsave
162.3 121 57.6 183.2 clipbox
92.546581 183.168 m
94.168232 183.168 l
94.168232 229.07193 l
92.546581 229.07193 l
cl
0.122 0.467 0.706 setrgbcolor
fill
grestore
gsave
162.3 121 57.6 183.2 clipbox
94.168232 183.168 m
95.789883 183.168 l
95.789883 228.694638 l
94.168232 228.694638 l
cl
0.122 0.467 0.706 setrgbcolor
fill
grestore
gsave
162.3 121 57.6 183.2 clipbox
95.789883 183.168 m
97.411534 183.168 l
97.411534 221.400314 l
95.789883 221.400314 l
cl
0.122 0.467 0.706 setrgbcolor
fill
grestore
gsave
162.3 121 57.6 183.2 clipbox
97.411534 183.168 m
99.033185 183.168 l
99.033185 215.992454 l
97.411534 215.992454 l
cl
0.122 0.467 0.706 setrgbcolor
fill
grestore
gsave
162.3 121 57.6 183.2 clipbox
99.033185 183.168 m
100.654836 183.168 l
100.654836 211.087651 l
99.033185 211.087651 l
cl
0.122 0.467 0.706 setrgbcolor
fill
grestore
gsave
162.3 121 57.6 183.2 clipbox
100.654836 183.168 m
102.276487 183.168 l
102.276487 209.955773 l
100.654836 209.955773 l
cl
0.122 0.467 0.706 setrgbcolor
fill
grestore
gsave
162.3 121 57.6 183.2 clipbox
102.276487 183.168 m
103.898138 183.168 l
103.898138 205.050969 l
102.276487 205.050969 l
cl
0.122 0.467 0.706 setrgbcolor
fill
grestore
gsave
162.3 121 57.6 183.2 clipbox
103.898138 183.168 m
105.519789 183.168 l
105.519789 202.535686 l
103.898138 202.535686 l
cl
0.122 0.467 0.706 setrgbcolor
fill
grestore
gsave
162.3 121 57.6 183.2 clipbox
105.519789 183.168 m
107.14144 183.168 l
107.14144 201.906865 l
105.519789 201.906865 l
cl
0.122 0.467 0.706 setrgbcolor
fill
grestore
gsave
162.3 121 57.6 183.2 clipbox
107.14144 183.168 m
108.763091 183.168 l
108.763091 199.517345 l
107.14144 199.517345 l
cl
0.122 0.467 0.706 setrgbcolor
fill
grestore
gsave
162.3 121 57.6 183.2 clipbox
108.763091 183.168 m
110.384743 183.168 l
110.384743 197.002061 l
108.763091 197.002061 l
cl
0.122 0.467 0.706 setrgbcolor
fill
grestore
gsave
162.3 121 57.6 183.2 clipbox
110.384743 183.168 m
112.006394 183.168 l
112.006394 194.86407 l
110.384743 194.86407 l
cl
0.122 0.467 0.706 setrgbcolor
fill
grestore
gsave
162.3 121 57.6 183.2 clipbox
112.006394 183.168 m
113.628045 183.168 l
113.628045 192.097258 l
112.006394 192.097258 l
cl
0.122 0.467 0.706 setrgbcolor
fill
grestore
gsave
162.3 121 57.6 183.2 clipbox
113.628045 183.168 m
115.249696 183.168 l
115.249696 193.229135 l
113.628045 193.229135 l
cl
0.122 0.467 0.706 setrgbcolor
fill
grestore
gsave
162.3 121 57.6 183.2 clipbox
115.249696 183.168 m
116.871347 183.168 l
116.871347 190.588087 l
115.249696 190.588087 l
cl
0.122 0.467 0.706 setrgbcolor
fill
grestore
gsave
162.3 121 57.6 183.2 clipbox
116.871347 183.168 m
118.492998 183.168 l
118.492998 191.216908 l
116.871347 191.216908 l
cl
0.122 0.467 0.706 setrgbcolor
fill
grestore
gsave
162.3 121 57.6 183.2 clipbox
118.492998 183.168 m
120.114649 183.168 l
120.114649 188.57586 l
118.492998 188.57586 l
cl
0.122 0.467 0.706 setrgbcolor
fill
grestore
gsave
162.3 121 57.6 183.2 clipbox
120.114649 183.168 m
121.7363 183.168 l
121.7363 187.947039 l
120.114649 187.947039 l
cl
0.122 0.467 0.706 setrgbcolor
fill
grestore
gsave
162.3 121 57.6 183.2 clipbox
121.7363 183.168 m
123.357951 183.168 l
123.357951 187.06669 l
121.7363 187.06669 l
cl
0.122 0.467 0.706 setrgbcolor
fill
grestore
gsave
162.3 121 57.6 183.2 clipbox
123.357951 183.168 m
124.979602 183.168 l
124.979602 186.563633 l
123.357951 186.563633 l
cl
0.122 0.467 0.706 setrgbcolor
fill
grestore
gsave
162.3 121 57.6 183.2 clipbox
124.979602 183.168 m
126.601253 183.168 l
126.601253 185.934812 l
124.979602 185.934812 l
cl
0.122 0.467 0.706 setrgbcolor
fill
grestore
gsave
162.3 121 57.6 183.2 clipbox
126.601253 183.168 m
128.222904 183.168 l
128.222904 187.192454 l
126.601253 187.192454 l
cl
0.122 0.467 0.706 setrgbcolor
fill
grestore
gsave
162.3 121 57.6 183.2 clipbox
128.222904 183.168 m
129.844555 183.168 l
129.844555 187.192454 l
128.222904 187.192454 l
cl
0.122 0.467 0.706 setrgbcolor
fill
grestore
gsave
162.3 121 57.6 183.2 clipbox
129.844555 183.168 m
131.466207 183.168 l
131.466207 185.431755 l
129.844555 185.431755 l
cl
0.122 0.467 0.706 setrgbcolor
fill
grestore
gsave
162.3 121 57.6 183.2 clipbox
131.466207 183.168 m
133.087858 183.168 l
133.087858 184.928699 l
131.466207 184.928699 l
cl
0.122 0.467 0.706 setrgbcolor
fill
grestore
gsave
162.3 121 57.6 183.2 clipbox
133.087858 183.168 m
134.709509 183.168 l
134.709509 185.054463 l
133.087858 185.054463 l
cl
0.122 0.467 0.706 setrgbcolor
fill
grestore
gsave
162.3 121 57.6 183.2 clipbox
134.709509 183.168 m
136.33116 183.168 l
136.33116 184.551406 l
134.709509 184.551406 l
cl
0.122 0.467 0.706 setrgbcolor
fill
grestore
gsave
162.3 121 57.6 183.2 clipbox
136.33116 183.168 m
137.952811 183.168 l
137.952811 184.802934 l
136.33116 184.802934 l
cl
0.122 0.467 0.706 setrgbcolor
fill
grestore
gsave
162.3 121 57.6 183.2 clipbox
137.952811 183.168 m
139.574462 183.168 l
139.574462 184.174114 l
137.952811 184.174114 l
cl
0.122 0.467 0.706 setrgbcolor
fill
grestore
gsave
162.3 121 57.6 183.2 clipbox
139.574462 183.168 m
141.196113 183.168 l
141.196113 183.671057 l
139.574462 183.671057 l
cl
0.122 0.467 0.706 setrgbcolor
fill
grestore
gsave
162.3 121 57.6 183.2 clipbox
141.196113 183.168 m
142.817764 183.168 l
142.817764 184.299878 l
141.196113 184.299878 l
cl
0.122 0.467 0.706 setrgbcolor
fill
grestore
gsave
162.3 121 57.6 183.2 clipbox
142.817764 183.168 m
144.439415 183.168 l
144.439415 184.551406 l
142.817764 184.551406 l
cl
0.122 0.467 0.706 setrgbcolor
fill
grestore
gsave
162.3 121 57.6 183.2 clipbox
144.439415 183.168 m
146.061066 183.168 l
146.061066 183.545293 l
144.439415 183.545293 l
cl
0.122 0.467 0.706 setrgbcolor
fill
grestore
gsave
162.3 121 57.6 183.2 clipbox
146.061066 183.168 m
147.682717 183.168 l
147.682717 183.922585 l
146.061066 183.922585 l
cl
0.122 0.467 0.706 setrgbcolor
fill
grestore
gsave
162.3 121 57.6 183.2 clipbox
147.682717 183.168 m
149.304368 183.168 l
149.304368 183.419528 l
147.682717 183.419528 l
cl
0.122 0.467 0.706 setrgbcolor
fill
grestore
gsave
162.3 121 57.6 183.2 clipbox
149.304368 183.168 m
150.926019 183.168 l
150.926019 184.048349 l
149.304368 184.048349 l
cl
0.122 0.467 0.706 setrgbcolor
fill
grestore
gsave
162.3 121 57.6 183.2 clipbox
150.926019 183.168 m
152.547671 183.168 l
152.547671 183.293764 l
150.926019 183.293764 l
cl
0.122 0.467 0.706 setrgbcolor
fill
grestore
gsave
162.3 121 57.6 183.2 clipbox
152.547671 183.168 m
154.169322 183.168 l
154.169322 183.545293 l
152.547671 183.545293 l
cl
0.122 0.467 0.706 setrgbcolor
fill
grestore
gsave
162.3 121 57.6 183.2 clipbox
154.169322 183.168 m
155.790973 183.168 l
155.790973 183.545293 l
154.169322 183.545293 l
cl
0.122 0.467 0.706 setrgbcolor
fill
grestore
gsave
162.3 121 57.6 183.2 clipbox
155.790973 183.168 m
157.412624 183.168 l
157.412624 183.671057 l
155.790973 183.671057 l
cl
0.122 0.467 0.706 setrgbcolor
fill
grestore
gsave
162.3 121 57.6 183.2 clipbox
157.412624 183.168 m
159.034275 183.168 l
159.034275 183.293764 l
157.412624 183.293764 l
cl
0.122 0.467 0.706 setrgbcolor
fill
grestore
gsave
162.3 121 57.6 183.2 clipbox
159.034275 183.168 m
160.655926 183.168 l
160.655926 183.293764 l
159.034275 183.293764 l
cl
0.122 0.467 0.706 setrgbcolor
fill
grestore
gsave
162.3 121 57.6 183.2 clipbox
160.655926 183.168 m
162.277577 183.168 l
162.277577 183.671057 l
160.655926 183.671057 l
cl
0.122 0.467 0.706 setrgbcolor
fill
grestore
gsave
162.3 121 57.6 183.2 clipbox
162.277577 183.168 m
163.899228 183.168 l
163.899228 183.293764 l
162.277577 183.293764 l
cl
0.122 0.467 0.706 setrgbcolor
fill
grestore
gsave
162.3 121 57.6 183.2 clipbox
163.899228 183.168 m
165.520879 183.168 l
165.520879 183.419528 l
163.899228 183.419528 l
cl
0.122 0.467 0.706 setrgbcolor
fill
grestore
gsave
162.3 121 57.6 183.2 clipbox
165.520879 183.168 m
167.14253 183.168 l
167.14253 183.293764 l
165.520879 183.293764 l
cl
0.122 0.467 0.706 setrgbcolor
fill
grestore
gsave
162.3 121 57.6 183.2 clipbox
167.14253 183.168 m
168.764181 183.168 l
168.764181 183.293764 l
167.14253 183.293764 l
cl
0.122 0.467 0.706 setrgbcolor
fill
grestore
gsave
162.3 121 57.6 183.2 clipbox
168.764181 183.168 m
170.385832 183.168 l
170.385832 183.419528 l
168.764181 183.419528 l
cl
0.122 0.467 0.706 setrgbcolor
fill
grestore
gsave
162.3 121 57.6 183.2 clipbox
170.385832 183.168 m
172.007483 183.168 l
172.007483 183.168 l
170.385832 183.168 l
cl
0.122 0.467 0.706 setrgbcolor
fill
grestore
gsave
162.3 121 57.6 183.2 clipbox
172.007483 183.168 m
173.629135 183.168 l
173.629135 183.168 l
172.007483 183.168 l
cl
0.122 0.467 0.706 setrgbcolor
fill
grestore
gsave
162.3 121 57.6 183.2 clipbox
173.629135 183.168 m
175.250786 183.168 l
175.250786 183.293764 l
173.629135 183.293764 l
cl
0.122 0.467 0.706 setrgbcolor
fill
grestore
gsave
162.3 121 57.6 183.2 clipbox
175.250786 183.168 m
176.872437 183.168 l
176.872437 183.168 l
175.250786 183.168 l
cl
0.122 0.467 0.706 setrgbcolor
fill
grestore
gsave
162.3 121 57.6 183.2 clipbox
176.872437 183.168 m
178.494088 183.168 l
178.494088 183.168 l
176.872437 183.168 l
cl
0.122 0.467 0.706 setrgbcolor
fill
grestore
gsave
162.3 121 57.6 183.2 clipbox
178.494088 183.168 m
180.115739 183.168 l
180.115739 183.168 l
178.494088 183.168 l
cl
0.122 0.467 0.706 setrgbcolor
fill
grestore
gsave
162.3 121 57.6 183.2 clipbox
180.115739 183.168 m
181.73739 183.168 l
181.73739 183.168 l
180.115739 183.168 l
cl
0.122 0.467 0.706 setrgbcolor
fill
grestore
gsave
162.3 121 57.6 183.2 clipbox
181.73739 183.168 m
183.359041 183.168 l
183.359041 183.168 l
181.73739 183.168 l
cl
0.122 0.467 0.706 setrgbcolor
fill
grestore
gsave
162.3 121 57.6 183.2 clipbox
183.359041 183.168 m
184.980692 183.168 l
184.980692 183.293764 l
183.359041 183.293764 l
cl
0.122 0.467 0.706 setrgbcolor
fill
grestore
gsave
162.3 121 57.6 183.2 clipbox
184.980692 183.168 m
186.602343 183.168 l
186.602343 183.168 l
184.980692 183.168 l
cl
0.122 0.467 0.706 setrgbcolor
fill
grestore
gsave
162.3 121 57.6 183.2 clipbox
186.602343 183.168 m
188.223994 183.168 l
188.223994 183.168 l
186.602343 183.168 l
cl
0.122 0.467 0.706 setrgbcolor
fill
grestore
gsave
162.3 121 57.6 183.2 clipbox
188.223994 183.168 m
189.845645 183.168 l
189.845645 183.168 l
188.223994 183.168 l
cl
0.122 0.467 0.706 setrgbcolor
fill
grestore
gsave
162.3 121 57.6 183.2 clipbox
189.845645 183.168 m
191.467296 183.168 l
191.467296 183.293764 l
189.845645 183.293764 l
cl
0.122 0.467 0.706 setrgbcolor
fill
grestore
gsave
162.3 121 57.6 183.2 clipbox
191.467296 183.168 m
193.088947 183.168 l
193.088947 183.168 l
191.467296 183.168 l
cl
0.122 0.467 0.706 setrgbcolor
fill
grestore
gsave
162.3 121 57.6 183.2 clipbox
193.088947 183.168 m
194.710598 183.168 l
194.710598 183.168 l
193.088947 183.168 l
cl
0.122 0.467 0.706 setrgbcolor
fill
grestore
gsave
162.3 121 57.6 183.2 clipbox
194.710598 183.168 m
196.33225 183.168 l
196.33225 183.168 l
194.710598 183.168 l
cl
0.122 0.467 0.706 setrgbcolor
fill
grestore
gsave
162.3 121 57.6 183.2 clipbox
196.33225 183.168 m
197.953901 183.168 l
197.953901 183.168 l
196.33225 183.168 l
cl
0.122 0.467 0.706 setrgbcolor
fill
grestore
gsave
162.3 121 57.6 183.2 clipbox
197.953901 183.168 m
199.575552 183.168 l
199.575552 183.168 l
197.953901 183.168 l
cl
0.122 0.467 0.706 setrgbcolor
fill
grestore
gsave
162.3 121 57.6 183.2 clipbox
199.575552 183.168 m
201.197203 183.168 l
201.197203 183.293764 l
199.575552 183.293764 l
cl
0.122 0.467 0.706 setrgbcolor
fill
grestore
gsave
162.3 121 57.6 183.2 clipbox
201.197203 183.168 m
202.818854 183.168 l
202.818854 183.168 l
201.197203 183.168 l
cl
0.122 0.467 0.706 setrgbcolor
fill
grestore
gsave
162.3 121 57.6 183.2 clipbox
202.818854 183.168 m
204.440505 183.168 l
204.440505 183.168 l
202.818854 183.168 l
cl
0.122 0.467 0.706 setrgbcolor
fill
grestore
gsave
162.3 121 57.6 183.2 clipbox
204.440505 183.168 m
206.062156 183.168 l
206.062156 183.168 l
204.440505 183.168 l
cl
0.122 0.467 0.706 setrgbcolor
fill
grestore
gsave
162.3 121 57.6 183.2 clipbox
206.062156 183.168 m
207.683807 183.168 l
207.683807 183.168 l
206.062156 183.168 l
cl
0.122 0.467 0.706 setrgbcolor
fill
grestore
gsave
162.3 121 57.6 183.2 clipbox
207.683807 183.168 m
209.305458 183.168 l
209.305458 183.168 l
207.683807 183.168 l
cl
0.122 0.467 0.706 setrgbcolor
fill
grestore
gsave
162.3 121 57.6 183.2 clipbox
209.305458 183.168 m
210.927109 183.168 l
210.927109 183.168 l
209.305458 183.168 l
cl
0.122 0.467 0.706 setrgbcolor
fill
grestore
gsave
162.3 121 57.6 183.2 clipbox
210.927109 183.168 m
212.54876 183.168 l
212.54876 183.293764 l
210.927109 183.293764 l
cl
0.122 0.467 0.706 setrgbcolor
fill
grestore
0.800 setlinewidth
1 setlinejoin
0 setlinecap
[] 0 setdash
0.000 setgray
gsave
/o {
gsave
newpath
translate
0.8 setlinewidth
1 setlinejoin
0 setlinecap
0 0 m
0 -3.5 l

gsave
0.000 setgray
fill
grestore
stroke
grestore
} bind def
97.4115 183.168 o
grestore
/DejaVuSans findfont
10.000 scalefont
setfont
gsave
91.052159 168.574250 translate
0.000000 rotate
0.000000 0.000000 m /two glyphshow
6.362305 0.000000 m /five glyphshow
grestore
gsave
/o {
gsave
newpath
translate
0.8 setlinewidth
1 setlinejoin
0 setlinecap
0 0 m
0 -3.5 l

gsave
0.000 setgray
fill
grestore
stroke
grestore
} bind def
137.953 183.168 o
grestore
gsave
131.593436 168.574250 translate
0.000000 rotate
0.000000 0.000000 m /five glyphshow
6.362305 0.000000 m /zero glyphshow
grestore
gsave
/o {
gsave
newpath
translate
0.8 setlinewidth
1 setlinejoin
0 setlinecap
0 0 m
0 -3.5 l

gsave
0.000 setgray
fill
grestore
stroke
grestore
} bind def
178.494 183.168 o
grestore
gsave
172.134713 168.574250 translate
0.000000 rotate
0.000000 0.000000 m /seven glyphshow
6.362305 0.000000 m /five glyphshow
grestore
gsave
/o {
gsave
newpath
translate
0.8 setlinewidth
1 setlinejoin
0 setlinecap
0 0 m
0 -3.5 l

gsave
0.000 setgray
fill
grestore
stroke
grestore
} bind def
219.035 183.168 o
grestore
gsave
209.496302 168.574250 translate
0.000000 rotate
0.000000 0.000000 m /one glyphshow
6.362305 0.000000 m /zero glyphshow
12.724609 0.000000 m /zero glyphshow
grestore
gsave
117.396449 154.902375 translate
0.000000 rotate
0.000000 0.000000 m /L glyphshow
5.571289 0.000000 m /a glyphshow
11.699219 0.000000 m /t glyphshow
15.620117 0.000000 m /e glyphshow
21.772461 0.000000 m /n glyphshow
28.110352 0.000000 m /c glyphshow
33.608398 0.000000 m /y glyphshow
39.526367 0.000000 m /space glyphshow
grestore
gsave
/o {
gsave
newpath
translate
0.8 setlinewidth
1 setlinejoin
0 setlinecap
0 0 m
-3.5 0 l

gsave
0.000 setgray
fill
grestore
stroke
grestore
} bind def
57.6 183.168 o
grestore
gsave
44.240625 179.371125 translate
0.000000 rotate
0.000000 0.000000 m /zero glyphshow
grestore
gsave
/o {
gsave
newpath
translate
0.8 setlinewidth
1 setlinejoin
0 setlinecap
0 0 m
-3.5 0 l

gsave
0.000 setgray
fill
grestore
stroke
grestore
} bind def
57.6 208.321 o
grestore
gsave
31.521875 204.523963 translate
0.000000 rotate
0.000000 0.000000 m /two glyphshow
6.362305 0.000000 m /zero glyphshow
12.724609 0.000000 m /zero glyphshow
grestore
gsave
/o {
gsave
newpath
translate
0.8 setlinewidth
1 setlinejoin
0 setlinecap
0 0 m
-3.5 0 l

gsave
0.000 setgray
fill
grestore
stroke
grestore
} bind def
57.6 233.474 o
grestore
gsave
31.521875 229.676802 translate
0.000000 rotate
0.000000 0.000000 m /four glyphshow
6.362305 0.000000 m /zero glyphshow
12.724609 0.000000 m /zero glyphshow
grestore
gsave
/o {
gsave
newpath
translate
0.8 setlinewidth
1 setlinejoin
0 setlinecap
0 0 m
-3.5 0 l

gsave
0.000 setgray
fill
grestore
stroke
grestore
} bind def
57.6 258.627 o
grestore
gsave
31.521875 254.829640 translate
0.000000 rotate
0.000000 0.000000 m /six glyphshow
6.362305 0.000000 m /zero glyphshow
12.724609 0.000000 m /zero glyphshow
grestore
gsave
/o {
gsave
newpath
translate
0.8 setlinewidth
1 setlinejoin
0 setlinecap
0 0 m
-3.5 0 l

gsave
0.000 setgray
fill
grestore
stroke
grestore
} bind def
57.6 283.779 o
grestore
gsave
31.521875 279.982479 translate
0.000000 rotate
0.000000 0.000000 m /eight glyphshow
6.362305 0.000000 m /zero glyphshow
12.724609 0.000000 m /zero glyphshow
grestore
gsave
25.443750 196.015187 translate
90.000000 rotate
0.000000 0.000000 m /N glyphshow
7.480469 0.000000 m /u glyphshow
13.818359 0.000000 m /m glyphshow
23.559570 0.000000 m /b glyphshow
29.907227 0.000000 m /e glyphshow
36.059570 0.000000 m /r glyphshow
40.170898 0.000000 m /space glyphshow
43.349609 0.000000 m /o glyphshow
49.467773 0.000000 m /f glyphshow
52.988281 0.000000 m /space glyphshow
56.166992 0.000000 m /p glyphshow
62.514648 0.000000 m /a glyphshow
68.642578 0.000000 m /c glyphshow
74.140625 0.000000 m /k glyphshow
79.931641 0.000000 m /e glyphshow
86.083984 0.000000 m /t glyphshow
90.004883 0.000000 m /s glyphshow
grestore
0 setlinejoin
2 setlinecap
[] 0 setdash
gsave
57.6 183.168 m
57.6 304.128 l
stroke
grestore
gsave
219.927273 183.168 m
219.927273 304.128 l
stroke
grestore
gsave
57.6 183.168 m
219.927273 183.168 l
stroke
grestore
gsave
57.6 304.128 m
219.927273 304.128 l
stroke
grestore
/DejaVuSans findfont
12.000 scalefont
setfont
gsave
113.623011 310.128000 translate
0.000000 rotate
0.000000 0.000000 m /b glyphshow
7.617188 0.000000 m /a glyphshow
14.970703 0.000000 m /s glyphshow
21.222656 0.000000 m /e glyphshow
28.605469 0.000000 m /l glyphshow
31.939453 0.000000 m /i glyphshow
35.273438 0.000000 m /n glyphshow
42.878906 0.000000 m /e glyphshow
grestore
1.000 setlinewidth
0 setlinecap
0.800 setgray
gsave
77.677273 281.456125 m
212.927273 281.456125 l
214.260606 281.456125 214.927273 282.122792 214.927273 283.456125 c
214.927273 297.128 l
214.927273 298.461333 214.260606 299.128 212.927273 299.128 c
77.677273 299.128 l
76.343939 299.128 75.677273 298.461333 75.677273 297.128 c
75.677273 283.456125 l
75.677273 282.122792 76.343939 281.456125 77.677273 281.456125 c
cl
gsave
1.000 setgray
fill
grestore
stroke
grestore
gsave
79.677273 287.53425 m
99.677273 287.53425 l
99.677273 294.53425 l
79.677273 294.53425 l
cl
0.122 0.467 0.706 setrgbcolor
fill
grestore
0.000 setgray
/DejaVuSans findfont
10.000 scalefont
setfont
gsave
107.677273 287.534250 translate
0.000000 rotate
0.000000 0.000000 m /i glyphshow
2.778320 0.000000 m /n glyphshow
9.116211 0.000000 m /j glyphshow
11.894531 0.000000 m /e glyphshow
18.046875 0.000000 m /c glyphshow
23.544922 0.000000 m /t glyphshow
27.465820 0.000000 m /i glyphshow
30.244141 0.000000 m /o glyphshow
36.362305 0.000000 m /n glyphshow
42.700195 0.000000 m /space glyphshow
45.878906 0.000000 m /r glyphshow
49.990234 0.000000 m /a glyphshow
56.118164 0.000000 m /t glyphshow
60.039062 0.000000 m /e glyphshow
66.191406 0.000000 m /space glyphshow
69.370117 0.000000 m /equal glyphshow
77.749023 0.000000 m /space glyphshow
80.927734 0.000000 m /zero glyphshow
87.290039 0.000000 m /period glyphshow
90.468750 0.000000 m /two glyphshow
96.831055 0.000000 m /four glyphshow
grestore
gsave
252.392727 183.168 m
414.72 183.168 l
414.72 304.128 l
252.392727 304.128 l
cl
1.000 setgray
fill
grestore
gsave
162.3 121 252.4 183.2 clipbox
259.77124 183.168 m
265.92 183.168 l
265.92 208.121251 l
259.77124 208.121251 l
cl
0.122 0.467 0.706 setrgbcolor
fill
grestore
gsave
162.3 121 252.4 183.2 clipbox
265.92 183.168 m
272.06876 183.168 l
272.06876 187.5209 l
265.92 187.5209 l
cl
0.122 0.467 0.706 setrgbcolor
fill
grestore
gsave
162.3 121 252.4 183.2 clipbox
272.06876 183.168 m
278.217521 183.168 l
278.217521 258.888211 l
272.06876 258.888211 l
cl
0.122 0.467 0.706 setrgbcolor
fill
grestore
gsave
162.3 121 252.4 183.2 clipbox
278.217521 183.168 m
284.366281 183.168 l
284.366281 198.80807 l
278.217521 198.80807 l
cl
0.122 0.467 0.706 setrgbcolor
fill
grestore
gsave
162.3 121 252.4 183.2 clipbox
284.366281 183.168 m
290.515041 183.168 l
290.515041 292.142341 l
284.366281 292.142341 l
cl
0.122 0.467 0.706 setrgbcolor
fill
grestore
gsave
162.3 121 252.4 183.2 clipbox
290.515041 183.168 m
296.663802 183.168 l
296.663802 214.14445 l
290.515041 214.14445 l
cl
0.122 0.467 0.706 setrgbcolor
fill
grestore
gsave
162.3 121 252.4 183.2 clipbox
296.663802 183.168 m
302.812562 183.168 l
302.812562 298.368 l
296.663802 298.368 l
cl
0.122 0.467 0.706 setrgbcolor
fill
grestore
gsave
162.3 121 252.4 183.2 clipbox
302.812562 183.168 m
308.961322 183.168 l
308.961322 218.952886 l
302.812562 218.952886 l
cl
0.122 0.467 0.706 setrgbcolor
fill
grestore
gsave
162.3 121 252.4 183.2 clipbox
308.961322 183.168 m
315.110083 183.168 l
315.110083 264.506489 l
308.961322 264.506489 l
cl
0.122 0.467 0.706 setrgbcolor
fill
grestore
gsave
162.3 121 252.4 183.2 clipbox
315.110083 183.168 m
321.258843 183.168 l
321.258843 216.3209 l
315.110083 216.3209 l
cl
0.122 0.467 0.706 setrgbcolor
fill
grestore
gsave
162.3 121 252.4 183.2 clipbox
321.258843 183.168 m
327.407603 183.168 l
327.407603 227.658685 l
321.258843 227.658685 l
cl
0.122 0.467 0.706 setrgbcolor
fill
grestore
gsave
162.3 121 252.4 183.2 clipbox
327.407603 183.168 m
333.556364 183.168 l
333.556364 203.565891 l
327.407603 203.565891 l
cl
0.122 0.467 0.706 setrgbcolor
fill
grestore
gsave
162.3 121 252.4 183.2 clipbox
333.556364 183.168 m
339.705124 183.168 l
339.705124 203.667121 l
333.556364 203.667121 l
cl
0.122 0.467 0.706 setrgbcolor
fill
grestore
gsave
162.3 121 252.4 183.2 clipbox
339.705124 183.168 m
345.853884 183.168 l
345.853884 195.265012 l
339.705124 195.265012 l
cl
0.122 0.467 0.706 setrgbcolor
fill
grestore
gsave
162.3 121 252.4 183.2 clipbox
345.853884 183.168 m
352.002645 183.168 l
352.002645 190.102271 l
345.853884 190.102271 l
cl
0.122 0.467 0.706 setrgbcolor
fill
grestore
gsave
162.3 121 252.4 183.2 clipbox
352.002645 183.168 m
358.151405 183.168 l
358.151405 188.178896 l
352.002645 188.178896 l
cl
0.122 0.467 0.706 setrgbcolor
fill
grestore
gsave
162.3 121 252.4 183.2 clipbox
358.151405 183.168 m
364.300165 183.168 l
364.300165 186.154292 l
358.151405 186.154292 l
cl
0.122 0.467 0.706 setrgbcolor
fill
grestore
gsave
162.3 121 252.4 183.2 clipbox
364.300165 183.168 m
370.448926 183.168 l
370.448926 184.888914 l
364.300165 184.888914 l
cl
0.122 0.467 0.706 setrgbcolor
fill
grestore
gsave
162.3 121 252.4 183.2 clipbox
370.448926 183.168 m
376.597686 183.168 l
376.597686 184.281533 l
370.448926 184.281533 l
cl
0.122 0.467 0.706 setrgbcolor
fill
grestore
gsave
162.3 121 252.4 183.2 clipbox
376.597686 183.168 m
382.746446 183.168 l
382.746446 184.180302 l
376.597686 184.180302 l
cl
0.122 0.467 0.706 setrgbcolor
fill
grestore
gsave
162.3 121 252.4 183.2 clipbox
382.746446 183.168 m
388.895207 183.168 l
388.895207 183.37046 l
382.746446 183.37046 l
cl
0.122 0.467 0.706 setrgbcolor
fill
grestore
gsave
162.3 121 252.4 183.2 clipbox
388.895207 183.168 m
395.043967 183.168 l
395.043967 183.471691 l
388.895207 183.471691 l
cl
0.122 0.467 0.706 setrgbcolor
fill
grestore
gsave
162.3 121 252.4 183.2 clipbox
395.043967 183.168 m
401.192727 183.168 l
401.192727 183.26923 l
395.043967 183.26923 l
cl
0.122 0.467 0.706 setrgbcolor
fill
grestore
gsave
162.3 121 252.4 183.2 clipbox
401.192727 183.168 m
407.341488 183.168 l
407.341488 183.218615 l
401.192727 183.218615 l
cl
0.122 0.467 0.706 setrgbcolor
fill
grestore
0.800 setlinewidth
1 setlinejoin
[] 0 setdash
gsave
/o {
gsave
newpath
translate
0.8 setlinewidth
1 setlinejoin
0 setlinecap
0 0 m
0 -3.5 l

gsave
0.000 setgray
fill
grestore
stroke
grestore
} bind def
290.515 183.168 o
grestore
gsave
284.155666 168.574250 translate
0.000000 rotate
0.000000 0.000000 m /one glyphshow
6.362305 0.000000 m /zero glyphshow
grestore
gsave
/o {
gsave
newpath
translate
0.8 setlinewidth
1 setlinejoin
0 setlinecap
0 0 m
0 -3.5 l

gsave
0.000 setgray
fill
grestore
stroke
grestore
} bind def
352.003 183.168 o
grestore
gsave
345.643270 168.574250 translate
0.000000 rotate
0.000000 0.000000 m /two glyphshow
6.362305 0.000000 m /zero glyphshow
grestore
gsave
/o {
gsave
newpath
translate
0.8 setlinewidth
1 setlinejoin
0 setlinecap
0 0 m
0 -3.5 l

gsave
0.000 setgray
fill
grestore
stroke
grestore
} bind def
413.49 183.168 o
grestore
gsave
407.130873 168.574250 translate
0.000000 rotate
0.000000 0.000000 m /three glyphshow
6.362305 0.000000 m /zero glyphshow
grestore
gsave
312.189176 154.902375 translate
0.000000 rotate
0.000000 0.000000 m /L glyphshow
5.571289 0.000000 m /a glyphshow
11.699219 0.000000 m /t glyphshow
15.620117 0.000000 m /e glyphshow
21.772461 0.000000 m /n glyphshow
28.110352 0.000000 m /c glyphshow
33.608398 0.000000 m /y glyphshow
39.526367 0.000000 m /space glyphshow
grestore
gsave
/o {
gsave
newpath
translate
0.8 setlinewidth
1 setlinejoin
0 setlinecap
0 0 m
-3.5 0 l

gsave
0.000 setgray
fill
grestore
stroke
grestore
} bind def
252.393 183.168 o
grestore
gsave
239.033352 179.371125 translate
0.000000 rotate
0.000000 0.000000 m /zero glyphshow
grestore
gsave
/o {
gsave
newpath
translate
0.8 setlinewidth
1 setlinejoin
0 setlinecap
0 0 m
-3.5 0 l

gsave
0.000 setgray
fill
grestore
stroke
grestore
} bind def
252.393 208.476 o
grestore
gsave
226.314602 204.678682 translate
0.000000 rotate
0.000000 0.000000 m /five glyphshow
6.362305 0.000000 m /zero glyphshow
12.724609 0.000000 m /zero glyphshow
grestore
gsave
/o {
gsave
newpath
translate
0.8 setlinewidth
1 setlinejoin
0 setlinecap
0 0 m
-3.5 0 l

gsave
0.000 setgray
fill
grestore
stroke
grestore
} bind def
252.393 233.783 o
grestore
gsave
219.955227 229.986239 translate
0.000000 rotate
0.000000 0.000000 m /one glyphshow
6.362305 0.000000 m /zero glyphshow
12.724609 0.000000 m /zero glyphshow
19.086914 0.000000 m /zero glyphshow
grestore
gsave
/o {
gsave
newpath
translate
0.8 setlinewidth
1 setlinejoin
0 setlinecap
0 0 m
-3.5 0 l

gsave
0.000 setgray
fill
grestore
stroke
grestore
} bind def
252.393 259.091 o
grestore
gsave
219.955227 255.293796 translate
0.000000 rotate
0.000000 0.000000 m /one glyphshow
6.362305 0.000000 m /five glyphshow
12.724609 0.000000 m /zero glyphshow
19.086914 0.000000 m /zero glyphshow
grestore
gsave
/o {
gsave
newpath
translate
0.8 setlinewidth
1 setlinejoin
0 setlinecap
0 0 m
-3.5 0 l

gsave
0.000 setgray
fill
grestore
stroke
grestore
} bind def
252.393 284.398 o
grestore
gsave
219.955227 280.601353 translate
0.000000 rotate
0.000000 0.000000 m /two glyphshow
6.362305 0.000000 m /zero glyphshow
12.724609 0.000000 m /zero glyphshow
19.086914 0.000000 m /zero glyphshow
grestore
gsave
213.877102 196.015187 translate
90.000000 rotate
0.000000 0.000000 m /N glyphshow
7.480469 0.000000 m /u glyphshow
13.818359 0.000000 m /m glyphshow
23.559570 0.000000 m /b glyphshow
29.907227 0.000000 m /e glyphshow
36.059570 0.000000 m /r glyphshow
40.170898 0.000000 m /space glyphshow
43.349609 0.000000 m /o glyphshow
49.467773 0.000000 m /f glyphshow
52.988281 0.000000 m /space glyphshow
56.166992 0.000000 m /p glyphshow
62.514648 0.000000 m /a glyphshow
68.642578 0.000000 m /c glyphshow
74.140625 0.000000 m /k glyphshow
79.931641 0.000000 m /e glyphshow
86.083984 0.000000 m /t glyphshow
90.004883 0.000000 m /s glyphshow
grestore
0 setlinejoin
2 setlinecap
[] 0 setdash
gsave
252.392727 183.168 m
252.392727 304.128 l
stroke
grestore
gsave
414.72 183.168 m
414.72 304.128 l
stroke
grestore
gsave
252.392727 183.168 m
414.72 183.168 l
stroke
grestore
gsave
252.392727 304.128 m
414.72 304.128 l
stroke
grestore
/DejaVuSans findfont
12.000 scalefont
setfont
gsave
309.407926 310.128000 translate
0.000000 rotate
0.000000 0.000000 m /S glyphshow
7.617188 0.000000 m /c glyphshow
14.214844 0.000000 m /h glyphshow
21.820312 0.000000 m /e glyphshow
29.203125 0.000000 m /m glyphshow
40.892578 0.000000 m /e glyphshow
grestore
1.000 setlinewidth
0 setlinecap
0.800 setgray
gsave
272.47 281.456125 m
407.72 281.456125 l
409.053333 281.456125 409.72 282.122792 409.72 283.456125 c
409.72 297.128 l
409.72 298.461333 409.053333 299.128 407.72 299.128 c
272.47 299.128 l
271.136667 299.128 270.47 298.461333 270.47 297.128 c
270.47 283.456125 l
270.47 282.122792 271.136667 281.456125 272.47 281.456125 c
cl
gsave
1.000 setgray
fill
grestore
stroke
grestore
gsave
274.47 287.53425 m
294.47 287.53425 l
294.47 294.53425 l
274.47 294.53425 l
cl
0.122 0.467 0.706 setrgbcolor
fill
grestore
0.000 setgray
/DejaVuSans findfont
10.000 scalefont
setfont
gsave
302.470000 287.534250 translate
0.000000 rotate
0.000000 0.000000 m /i glyphshow
2.778320 0.000000 m /n glyphshow
9.116211 0.000000 m /j glyphshow
11.894531 0.000000 m /e glyphshow
18.046875 0.000000 m /c glyphshow
23.544922 0.000000 m /t glyphshow
27.465820 0.000000 m /i glyphshow
30.244141 0.000000 m /o glyphshow
36.362305 0.000000 m /n glyphshow
42.700195 0.000000 m /space glyphshow
45.878906 0.000000 m /r glyphshow
49.990234 0.000000 m /a glyphshow
56.118164 0.000000 m /t glyphshow
60.039062 0.000000 m /e glyphshow
66.191406 0.000000 m /space glyphshow
69.370117 0.000000 m /equal glyphshow
77.749023 0.000000 m /space glyphshow
80.927734 0.000000 m /zero glyphshow
87.290039 0.000000 m /period glyphshow
90.468750 0.000000 m /two glyphshow
96.831055 0.000000 m /four glyphshow
grestore

end
showpage
