 
=======
VC0stats: 
avg_lat is: 11.261330255979857
min_lat is:5
max_lat is:28
total packets: 19064
95% avg_lat: 10.822879166022485
95% latency stopper is: 18
======
 
=======
VC1stats: 
avg_lat is: 12.278622087132726
min_lat is:5
max_lat is:24
total packets: 2961
95% avg_lat: 11.862279813007698
95% latency stopper is: 18
======
 
=======
VC2stats: 
avg_lat is: 11.0
min_lat is:8
max_lat is:14
total packets: 13
95% avg_lat: 10.445344129554655
95% latency stopper is: 14
======
 
=======
VC3stats: 
avg_lat is: 15.0
min_lat is:11
max_lat is:19
total packets: 2
95% avg_lat: 5.7894736842105265
95% latency stopper is: 19
======
 
=======
VC4stats: 
avg_lat is: 12.675488395391552
min_lat is:4
max_lat is:88
total packets: 23956
95% avg_lat: 11.98091237444086
95% latency stopper is: 20
======
 
=======
VC5stats: 
avg_lat is: 13.80741069447526
min_lat is:4
max_lat is:61
total packets: 4507
95% avg_lat: 13.026753704763351
95% latency stopper is: 22
======
 
=======
VC6stats: 
avg_lat is: 17.401015228426395
min_lat is:4
max_lat is:66
total packets: 591
95% avg_lat: 16.142131979695435
95% latency stopper is: 33
======
 
=======
VC7stats: 
avg_lat is: 20.77386934673367
min_lat is:4
max_lat is:57
total packets: 199
95% avg_lat: 19.492197831261574
95% latency stopper is: 38
======
 
=======
VC8stats: 
avg_lat is: 10.0176563321072
min_lat is:4
max_lat is:49
total packets: 9515
95% avg_lat: 9.549907348507896
95% latency stopper is: 16
======
 
=======
VC9stats: 
avg_lat is: 10.687830687830688
min_lat is:4
max_lat is:26
total packets: 189
95% avg_lat: 10.14759120022278
95% latency stopper is: 16
======
 
=======
VC10stats: 
avg_lat is: 10.466666666666667
min_lat is:4
max_lat is:22
total packets: 15
95% avg_lat: 9.473684210526315
95% latency stopper is: 22
======
 
