 
=======
VC0stats: 
avg_lat is: 12.23789764868603
min_lat is:5
max_lat is:28
total packets: 14460
95% avg_lat: 11.735531775496833
95% latency stopper is: 20
======
 
=======
VC1stats: 
avg_lat is: 12.390303716279947
min_lat is:5
max_lat is:30
total packets: 5301
95% avg_lat: 11.886932952074584
95% latency stopper is: 20
======
 
=======
VC2stats: 
avg_lat is: 12.395470383275262
min_lat is:5
max_lat is:28
total packets: 1148
95% avg_lat: 11.861360718870348
95% latency stopper is: 20
======
 
=======
VC3stats: 
avg_lat is: 13.743589743589743
min_lat is:5
max_lat is:26
total packets: 117
95% avg_lat: 13.189383715699506
95% latency stopper is: 22
======
 
=======
VC4stats: 
avg_lat is: 11.332192952446118
min_lat is:5
max_lat is:28
total packets: 14615
95% avg_lat: 10.881610457892936
95% latency stopper is: 18
======
 
=======
VC5stats: 
avg_lat is: 11.569207994078461
min_lat is:5
max_lat is:30
total packets: 5404
95% avg_lat: 11.112820912384588
95% latency stopper is: 18
======
 
=======
VC6stats: 
avg_lat is: 11.834690553745927
min_lat is:5
max_lat is:28
total packets: 1228
95% avg_lat: 11.365506600377165
95% latency stopper is: 18
======
 
=======
VC7stats: 
avg_lat is: 12.322314049586776
min_lat is:5
max_lat is:26
total packets: 121
95% avg_lat: 11.76163549369291
95% latency stopper is: 18
======
 
=======
VC8stats: 
avg_lat is: 1611.7218079096044
min_lat is:13
max_lat is:4606
total packets: 4425
95% avg_lat: 1475.9317276241452
95% latency stopper is: 3864
======
 
=======
VC9stats: 
avg_lat is: 1601.850225790266
min_lat is:15
max_lat is:4646
total packets: 3986
95% avg_lat: 1465.2919428526159
95% latency stopper is: 3823
======
 
=======
VC10stats: 
avg_lat is: 1610.3032960387059
min_lat is:22
max_lat is:4661
total packets: 3307
95% avg_lat: 1472.1592156987572
95% latency stopper is: 3900
======
 
=======
VC11stats: 
avg_lat is: 1615.265
min_lat is:18
max_lat is:4518
total packets: 2600
95% avg_lat: 1483.0481781376518
95% latency stopper is: 3845
======
total latency is: 23544449
total packets are: 56712
Average latency of network is: 415.1581499506277
