{
	"schemaVersion": "0.2.0",
	"license": "TODO",
	"copyright": "©  2019 Shakti",
	"boards": {
		"shakti-arduino": {
			"displayName": "Shakti Arduino",
			"description": "The Shakti is an Arduino-Compatible development kit with RISC-V SoC.",
			"supplier": {
				"displayName": "Shakti",
				"id": "1"
			},
			"revision": "A01",
			"url": "http://shakti.org.in/",
			"installedDevice": {
				"supplier": {
					"displayName": "Shakti",
					"id": "1"
				},
				"name": "arduinox"
			},
			"compatibleDevices": [],
			"features": {
				"flash": {
					"size": "256 Mb",
					"interface": "spi0",
					"memoryRegion": "rom"
				},
				"hfxtal": "16 MHz",
				"lfxtal": "32768 Hz"
			},
			"debug": {
				"interface": "ftdi",
				"connector": "micro-usb",
				"openocd": "-f &quot;board/sifive-hifive1.cfg&quot;",
				"jlink": {
				    "device": "arduinox"
				}
			},
			"compiler": {
				"headers": [
					"<micro-os-plus/board.h>"
				],
				"defines": [
					"SHAKTI_ARDUINO_BOARD"
				]
			}
		}
	}
}
