{
    "name": "UserDashboard",
    "alias": "userdashboard",
    "description": "",
    "keywords": [],
    "order": 0,
    "providers": [
        "Modules\\UserDashboard\\Providers\\DashboardServiceProvider"
    ],
    "aliases": {},
    "files": [],
    "requires": []
}
