{
    "name": "UserInvoice",
    "alias": "userinvoice",
    "description": "",
    "keywords": [],
    "order": 0,
    "providers": [
        "Modules\\UserInvoice\\Providers\\UserInvoiceServiceProvider"
    ],
    "aliases": {},
    "files": [],
    "requires": []
}
