<svg width="20" height="14" viewBox="0 0 20 14" fill="none" xmlns="http://www.w3.org/2000/svg">
<path d="M18.9571 7.71786C19.2843 7.39063 19.2843 6.8601 18.9571 6.53288L13.6247 1.20047C13.2975 0.873246 12.7669 0.873246 12.4397 1.20047C12.1125 1.52769 12.1125 2.05823 12.4397 2.38545L17.1796 7.12537L12.4397 11.8653C12.1125 12.1925 12.1125 12.723 12.4397 13.0503C12.7669 13.3775 13.2975 13.3775 13.6247 13.0503L18.9571 7.71786ZM0.489258 7.96327L18.3646 7.96327V6.28746L0.489258 6.28746L0.489258 7.96327Z" fill="#797979"/>
</svg>
