[
    {
        "nameID": "Activewear",
        "name": "Activewear",
        "brand": "Jhanvi's  Brand",
        "price": "123.00",
        "urlImg": "../public/images/categoriesForMen/Rectangle7.png",
        "article": 9.5411,
        "color": [
            "orangered",
            "gray",
            "green",
            "navy"
        ]
    },
    {
        "nameID": "Activewear",
        "name": "Activewear",
        "brand": "AS's  Brand",
        "price": "39.00",
        "urlImg": "../public/images/categoriesForMen/Rectangle7.png",
        "article": 9.23261,
        "color": [
            "aqua",
            "gray",
            "green",
            "navy"
        ]
    },
    {
        "nameID": "Activewear",
        "name": "Activewear",
        "brand": "MM's  Brand",
        "price": "37.00",
        "urlImg": "../public/images/categoriesForMen/Rectangle7.png",
        "article": 9.123242,
        "color": [
            "black",
            "gray",
            "green",
            "navy"
        ]
    },
    {
        "nameID": "Activewear",
        "name": "Activewear",
        "brand": "Nike's  Brand",
        "price": "119.00",
        "urlImg": "../public/images/categoriesForMen/Rectangle7.png",
        "article": 9.4554,
        "color": [
            "purple",
            "gray",
            "green",
            "navy"
        ]
    },
    {
        "nameID": "Activewear",
        "name": "Activewear",
        "brand": "Staff  Brand",
        "price": "105.00",
        "urlImg": "../public/images/categoriesForMen/Rectangle7.png",
        "article": 9.5678764,
        "color": [
            "orange",
            "gray",
            "green",
            "navy"
        ]
    },
    {
        "nameID": "Activewear",
        "name": "Activewear",
        "brand": "Staff  Brand",
        "price": "145.00",
        "urlImg": "../public/images/categoriesForMen/Rectangle7.png",
        "article": 9.641452,
        "color": [
            "green",
            "gray",
            "green",
            "navy"
        ]
    },
    {
        "nameID": "Activewear",
        "name": "Activewear",
        "brand": "Zara  Brand",
        "price": "89.00",
        "urlImg": "../public/images/categoriesForMen/Rectangle7.png",
        "article": 9.73424512,
        "color": [
            "blue",
            "gray",
            "green",
            "navy"
        ]
    },
    {
        "nameID": "Activewear",
        "name": "Activewear",
        "brand": "Reserved  Brand",
        "price": "99.00",
        "urlImg": "../public/images/categoriesForMen/Rectangle7.png",
        "article": 9.642345,
        "color": [
            "blue",
            "gray",
            "green",
            "navy"
        ]
    },
    {
        "nameID": "Activewear",
        "name": "Activewear",
        "brand": "Pull&Bear  Brand",
        "price": "79.00",
        "urlImg": "../public/images/categoriesForMen/Rectangle7.png",
        "article": 9.457807,
        "color": [
            "brown",
            "gray",
            "green",
            "navy"
        ]
    },
    {
        "nameID": "Activewear",
        "name": "Activewear",
        "brand": "Berchka  Brand",
        "price": "180.00",
        "urlImg": "../public/images/categoriesForMen/Rectangle7.png",
        "article": 9.1075656,
        "color": [
            "aqua",
            "gray",
            "green",
            "navy"
        ]
    },
    {
        "nameID": "Activewear",
        "name": "Activewear",
        "brand": "Cropp  Brand",
        "price": "69.00",
        "urlImg": "../public/images/categoriesForMen/Rectangle7.png",
        "article": 9.178094,
        "color": [
            "brown",
            "gray",
            "green",
            "navy"
        ]
    },
    {
        "nameID": "Activewear",
        "name": "Activewear",
        "brand": "Cropp  Brand",
        "price": "59.00",
        "urlImg": "../public/images/categoriesForMen/Rectangle7.png",
        "article": 9.146569977,
        "color": [
            "black",
            "gray",
            "green",
            "navy"
        ]
    }
]