[
    {
        "nameID": "Tees & Shirt",
        "name": "Tees & Shirt",
        "brand": "Jhanvi's  Brand",
        "price": "123.00",
        "urlImg": "../public/images/categoriesForWomen/Rectangle11.png",
        "article": 9.545611,
        "color": [
            "orangered",
            "gray",
            "green",
            "navy"
        ]
    },
    {
        "nameID": "Tees & Shirt",
        "name": "Tees & Shirt",
        "brand": "AS's  Brand",
        "price": "39.00",
        "urlImg": "../public/images/categoriesForWomen/Rectangle11.png",
        "article": 9.2356261,
        "color": [
            "aqua",
            "gray",
            "green",
            "navy"
        ]
    },
    {
        "nameID": "Tees & Shirt",
        "name": "Tees & Shirt",
        "brand": "MM's  Brand",
        "price": "37.00",
        "urlImg": "../public/images/categoriesForWomen/Rectangle11.png",
        "article": 9.1234324242,
        "color": [
            "black",
            "gray",
            "green",
            "navy"
        ]
    },
    {
        "nameID": "Tees & Shirt",
        "name": "Tees & Shirt",
        "brand": "Nike's  Brand",
        "price": "119.00",
        "urlImg": "../public/images/categoriesForWomen/Rectangle11.png",
        "article": 9.45523424,
        "color": [
            "purple",
            "gray",
            "green",
            "navy"
        ]
    },
    {
        "nameID": "Tees & Shirt",
        "name": "Tees & Shirt",
        "brand": "Staff  Brand",
        "price": "105.00",
        "urlImg": "../public/images/categoriesForWomen/Rectangle11.png",
        "article": 9.5673458764,
        "color": [
            "orange",
            "gray",
            "green",
            "navy"
        ]
    },
    {
        "nameID": "Tees & Shirt",
        "name": "Tees & Shirt",
        "brand": "Staff  Brand",
        "price": "145.00",
        "urlImg": "../public/images/categoriesForWomen/Rectangle11.png",
        "article": 9.641345452,
        "color": [
            "green",
            "gray",
            "green",
            "navy"
        ]
    },
    {
        "nameID": "Tees & Shirt",
        "name": "Tees & Shirt",
        "brand": "Zara  Brand",
        "price": "89.00",
        "urlImg": "../public/images/categoriesForWomen/Rectangle11.png",
        "article": 9.73423424512,
        "color": [
            "blue",
            "gray",
            "green",
            "navy"
        ]
    },
    {
        "nameID": "Tees & Shirt",
        "name": "Tees & Shirt",
        "brand": "Reserved  Brand",
        "price": "99.00",
        "urlImg": "../public/images/categoriesForWomen/Rectangle11.png",
        "article": 9.642656345,
        "color": [
            "blue",
            "gray",
            "green",
            "navy"
        ]
    },
    {
        "nameID": "Tees & Shirt",
        "name": "Tees & Shirt",
        "brand": "Pull&Bear  Brand",
        "price": "79.00",
        "urlImg": "../public/images/categoriesForWomen/Rectangle11.png",
        "article": 9.457867607,
        "color": [
            "brown",
            "gray",
            "green",
            "navy"
        ]
    },
    {
        "nameID": "Tees & Shirt",
        "name": "Tees & Shirt",
        "brand": "Berchka  Brand",
        "price": "180.00",
        "urlImg": "../public/images/categoriesForWomen/Rectangle11.png",
        "article": 9.1073425656,
        "color": [
            "aqua",
            "gray",
            "green",
            "navy"
        ]
    },
    {
        "nameID": "Tees & Shirt",
        "name": "Tees & Shirt",
        "brand": "Cropp  Brand",
        "price": "69.00",
        "urlImg": "../public/images/categoriesForWomen/Rectangle11.png",
        "article": 9.178454094,
        "color": [
            "brown",
            "gray",
            "green",
            "navy"
        ]
    },
    {
        "nameID": "Tees & Shirt",
        "name": "Tees & Shirt",
        "brand": "Cropp  Brand",
        "price": "59.00",
        "urlImg": "../public/images/categoriesForWomen/Rectangle11.png",
        "article": 9.146523469977,
        "color": [
            "black",
            "gray",
            "green",
            "navy"
        ]
    }
]