    [
        {
            "name": "Shirts",
            "urlImg": "./public/images/categoriesForMen/Rectangle1.png",
            "article": 1
        },
        {
            "name": "Printed T-Shirts",
            "urlImg": "./public/images/categoriesForMen/Rectangle2.png",
            "article": 2
        },
        {
            "name": "Plain T-Shirt",
            "urlImg": "./public/images/categoriesForMen/Rectangle3.png",
            "article": 3
        },
        {
            "name": "Polo T-Shirt",
            "urlImg": "./public/images/categoriesForMen/Rectangle4.png",
            "article": 4
        },
        {
            "name": "Hoodies & Sweetshirt",
            "urlImg": "./public/images/categoriesForMen/Rectangle5.png",
            "article": 5
        },
        {
            "name": "Jeans",
            "urlImg": "./public/images/categoriesForMen/Rectangle6.png",
            "article": 6
        },
        {
            "name": "Activewear",
            "urlImg": "./public/images/categoriesForMen/Rectangle7.png",
            "article": 7
        },
        {
            "name": "Boxers",
            "urlImg": "./public/images/categoriesForMen/Rectangle8.png",
            "article": 8
        }
    ]