[
    {
        "nameID": "Coats & Parkas",
        "name": "Coats & Parkas",
        "brand": "Jhanvi's  Brand",
        "price": "123.00",
        "urlImg": "../public/images/categoriesForWomen/Rectangle10.png",
        "article": 9.5466,
        "color": [
            "orangered",
            "gray",
            "green",
            "navy"
        ]
    },
    {
        "nameID": "Coats & Parkas",
        "name": "Coats & Parkas",
        "brand": "AS's  Brand",
        "price": "39.00",
        "urlImg": "../public/images/categoriesForWomen/Rectangle10.png",
        "article": 9.2324771,
        "color": [
            "aqua",
            "gray",
            "green",
            "navy"
        ]
    },
    {
        "nameID": "Coats & Parkas",
        "name": "Coats & Parkas",
        "brand": "MM's  Brand",
        "price": "37.00",
        "urlImg": "../public/images/categoriesForWomen/Rectangle10.png",
        "article": 9.12326662,
        "color": [
            "black",
            "gray",
            "green",
            "navy"
        ]
    },
    {
        "nameID": "Coats & Parkas",
        "name": "Coats & Parkas",
        "brand": "Nike's  Brand",
        "price": "119.00",
        "urlImg": "../public/images/categoriesForWomen/Rectangle10.png",
        "article": 9.4457774,
        "color": [
            "purple",
            "gray",
            "green",
            "navy"
        ]
    },
    {
        "nameID": "Coats & Parkas",
        "name": "Coats & Parkas",
        "brand": "Staff  Brand",
        "price": "105.00",
        "urlImg": "../public/images/categoriesForWomen/Rectangle10.png",
        "article": 9.56444764,
        "color": [
            "orange",
            "gray",
            "green",
            "navy"
        ]
    },
    {
        "nameID": "Coats & Parkas",
        "name": "Coats & Parkas",
        "brand": "Staff  Brand",
        "price": "145.00",
        "urlImg": "../public/images/categoriesForWomen/Rectangle10.png",
        "article": 9.641666782,
        "color": [
            "green",
            "gray",
            "green",
            "navy"
        ]
    },
    {
        "nameID": "Coats & Parkas",
        "name": "Coats & Parkas",
        "brand": "Zara  Brand",
        "price": "89.00",
        "urlImg": "../public/images/categoriesForWomen/Rectangle10.png",
        "article": 9.73427774534,
        "color": [
            "blue",
            "gray",
            "green",
            "navy"
        ]
    },
    {
        "nameID": "Coats & Parkas",
        "name": "Coats & Parkas",
        "brand": "Reserved  Brand",
        "price": "99.00",
        "urlImg": "../public/images/categoriesForWomen/Rectangle10.png",
        "article": 9.642444325,
        "color": [
            "blue",
            "gray",
            "green",
            "navy"
        ]
    },
    {
        "nameID": "Coats & Parkas",
        "name": "Coats & Parkas",
        "brand": "Pull&Bear  Brand",
        "price": "79.00",
        "urlImg": "../public/images/categoriesForWomen/Rectangle10.png",
        "article": 9.4545666907,
        "color": [
            "brown",
            "gray",
            "green",
            "navy"
        ]
    },
    {
        "nameID": "Coats & Parkas",
        "name": "Coats & Parkas",
        "brand": "Berchka  Brand",
        "price": "180.00",
        "urlImg": "../public/images/categoriesForWomen/Rectangle10.png",
        "article": 9.1078733656,
        "color": [
            "aqua",
            "gray",
            "green",
            "navy"
        ]
    },
    {
        "nameID": "Coats & Parkas",
        "name": "Coats & Parkas",
        "brand": "Cropp  Brand",
        "price": "69.00",
        "urlImg": "../public/images/categoriesForWomen/Rectangle10.png",
        "article": 9.13339094,
        "color": [
            "brown",
            "gray",
            "green",
            "navy"
        ]
    },
    {
        "nameID": "Coats & Parkas",
        "name": "Coats & Parkas",
        "brand": "Cropp  Brand",
        "price": "59.00",
        "urlImg": "../public/images/categoriesForWomen/Rectangle10.png",
        "article": 9.1465522777,
        "color": [
            "black",
            "gray",
            "green",
            "navy"
        ]
    }
]