[
    {
        "nameID": "Boxers",
        "name": "Boxers",
        "brand": "Jhanvi's  Brand",
        "price": "123.00",
        "urlImg": "../public/images/categoriesForWomen/Rectangle12.png",
        "article": 9.5411444,
        "color": [
            "orangered",
            "gray",
            "green",
            "navy"
        ]
    },
    {
        "nameID": "Boxers",
        "name": "Boxers",
        "brand": "AS's  Brand",
        "price": "39.00",
        "urlImg": "../public/images/categoriesForWomen/Rectangle12.png",
        "article": 9.2781171,
        "color": [
            "aqua",
            "gray",
            "green",
            "navy"
        ]
    },
    {
        "nameID": "Boxers",
        "name": "Boxers",
        "brand": "MM's  Brand",
        "price": "37.00",
        "urlImg": "../public/images/categoriesForWomen/Rectangle12.png",
        "article": 9.141142,
        "color": [
            "black",
            "gray",
            "green",
            "navy"
        ]
    },
    {
        "nameID": "Boxers",
        "name": "Boxers",
        "brand": "Nike's  Brand",
        "price": "119.00",
        "urlImg": "../public/images/categoriesForWomen/Rectangle12.png",
        "article": 9.475224,
        "color": [
            "purple",
            "gray",
            "green",
            "navy"
        ]
    },
    {
        "nameID": "Boxers",
        "name": "Boxers",
        "brand": "Staff  Brand",
        "price": "105.00",
        "urlImg": "../public/images/categoriesForWomen/Rectangle12.png",
        "article": 9.544564,
        "color": [
            "orange",
            "gray",
            "green",
            "navy"
        ]
    },
    {
        "nameID": "Boxers",
        "name": "Boxers",
        "brand": "Staff  Brand",
        "price": "145.00",
        "urlImg": "../public/images/categoriesForWomen/Rectangle12.png",
        "article": 9.666642,
        "color": [
            "green",
            "gray",
            "green",
            "navy"
        ]
    },
    {
        "nameID": "Boxers",
        "name": "Boxers",
        "brand": "Zara  Brand",
        "price": "89.00",
        "urlImg": "../public/images/categoriesForWomen/Rectangle12.png",
        "article": 9.73774242,
        "color": [
            "blue",
            "gray",
            "green",
            "navy"
        ]
    },
    {
        "nameID": "Boxers",
        "name": "Boxers",
        "brand": "Reserved  Brand",
        "price": "99.00",
        "urlImg": "../public/images/categoriesForWomen/Rectangle12.png",
        "article": 9.6995,
        "color": [
            "blue",
            "gray",
            "green",
            "navy"
        ]
    },
    {
        "nameID": "Boxers",
        "name": "Boxers",
        "brand": "Pull&Bear  Brand",
        "price": "79.00",
        "urlImg": "../public/images/categoriesForWomen/Rectangle12.png",
        "article": 9.400007,
        "color": [
            "brown",
            "gray",
            "green",
            "navy"
        ]
    },
    {
        "nameID": "Boxers",
        "name": "Boxers",
        "brand": "Berchka  Brand",
        "price": "180.00",
        "urlImg": "../public/images/categoriesForWomen/Rectangle12.png",
        "article": 9.1667656,
        "color": [
            "aqua",
            "gray",
            "green",
            "navy"
        ]
    },
    {
        "nameID": "Boxers",
        "name": "Boxers",
        "brand": "Cropp  Brand",
        "price": "69.00",
        "urlImg": "../public/images/categoriesForWomen/Rectangle12.png",
        "article": 9.149454,
        "color": [
            "brown",
            "gray",
            "green",
            "navy"
        ]
    },
    {
        "nameID": "Boxers",
        "name": "Boxers",
        "brand": "Cropp  Brand",
        "price": "59.00",
        "urlImg": "../public/images/categoriesForWomen/Rectangle12.png",
        "article": 9.1945977,
        "color": [
            "black",
            "gray",
            "green",
            "navy"
        ]
    }
]