[
    {
        "nameID": "Boxers",
        "name": "Boxers",
        "brand": "Jhanvi's  Brand",
        "price": "123.00",
        "urlImg": "../public/images/categoriesForMen/Rectangle8.png",
        "article": 9.54444,
        "color": [
            "orangered",
            "gray",
            "green",
            "navy"
        ]
    },
    {
        "nameID": "Boxers",
        "name": "Boxers",
        "brand": "AS's  Brand",
        "price": "39.00",
        "urlImg": "../public/images/categoriesForMen/Rectangle8.png",
        "article": 9.27871,
        "color": [
            "aqua",
            "gray",
            "green",
            "navy"
        ]
    },
    {
        "nameID": "Boxers",
        "name": "Boxers",
        "brand": "MM's  Brand",
        "price": "37.00",
        "urlImg": "../public/images/categoriesForMen/Rectangle8.png",
        "article": 9.1442,
        "color": [
            "black",
            "gray",
            "green",
            "navy"
        ]
    },
    {
        "nameID": "Boxers",
        "name": "Boxers",
        "brand": "Nike's  Brand",
        "price": "119.00",
        "urlImg": "../public/images/categoriesForMen/Rectangle8.png",
        "article": 9.4754,
        "color": [
            "purple",
            "gray",
            "green",
            "navy"
        ]
    },
    {
        "nameID": "Boxers",
        "name": "Boxers",
        "brand": "Staff  Brand",
        "price": "105.00",
        "urlImg": "../public/images/categoriesForMen/Rectangle8.png",
        "article": 9.5564,
        "color": [
            "orange",
            "gray",
            "green",
            "navy"
        ]
    },
    {
        "nameID": "Boxers",
        "name": "Boxers",
        "brand": "Staff  Brand",
        "price": "145.00",
        "urlImg": "../public/images/categoriesForMen/Rectangle8.png",
        "article": 9.642,
        "color": [
            "green",
            "gray",
            "green",
            "navy"
        ]
    },
    {
        "nameID": "Boxers",
        "name": "Boxers",
        "brand": "Zara  Brand",
        "price": "89.00",
        "urlImg": "../public/images/categoriesForMen/Rectangle8.png",
        "article": 9.734242,
        "color": [
            "blue",
            "gray",
            "green",
            "navy"
        ]
    },
    {
        "nameID": "Boxers",
        "name": "Boxers",
        "brand": "Reserved  Brand",
        "price": "99.00",
        "urlImg": "../public/images/categoriesForMen/Rectangle8.png",
        "article": 9.645,
        "color": [
            "blue",
            "gray",
            "green",
            "navy"
        ]
    },
    {
        "nameID": "Boxers",
        "name": "Boxers",
        "brand": "Pull&Bear  Brand",
        "price": "79.00",
        "urlImg": "../public/images/categoriesForMen/Rectangle8.png",
        "article": 9.407,
        "color": [
            "brown",
            "gray",
            "green",
            "navy"
        ]
    },
    {
        "nameID": "Boxers",
        "name": "Boxers",
        "brand": "Berchka  Brand",
        "price": "180.00",
        "urlImg": "../public/images/categoriesForMen/Rectangle8.png",
        "article": 9.1656,
        "color": [
            "aqua",
            "gray",
            "green",
            "navy"
        ]
    },
    {
        "nameID": "Boxers",
        "name": "Boxers",
        "brand": "Cropp  Brand",
        "price": "69.00",
        "urlImg": "../public/images/categoriesForMen/Rectangle8.png",
        "article": 9.1494,
        "color": [
            "brown",
            "gray",
            "green",
            "navy"
        ]
    },
    {
        "nameID": "Boxers",
        "name": "Boxers",
        "brand": "Cropp  Brand",
        "price": "59.00",
        "urlImg": "../public/images/categoriesForMen/Rectangle8.png",
        "article": 9.19977,
        "color": [
            "black",
            "gray",
            "green",
            "navy"
        ]
    }
]