<svg width="16" height="17" viewBox="0 0 16 17" fill="none" xmlns="http://www.w3.org/2000/svg">
<mask id="mask0_6511_8867" style="mask-type:luminance" maskUnits="userSpaceOnUse" x="0" y="0" width="16" height="16">
<path d="M15.3713 0.82959H0.3125V15.8884H15.3713V0.82959Z" fill="white"/>
</mask>
<g mask="url(#mask0_6511_8867)">
<path d="M13.4874 8.62503V7.73153C13.4874 6.23385 12.8925 4.79749 11.8334 3.73846C10.7744 2.67944 9.33804 2.08447 7.84035 2.08447C6.34265 2.08447 4.90631 2.67944 3.84728 3.73846C2.78824 4.79749 2.19329 6.23385 2.19329 7.73153V8.62503C1.53519 8.91481 0.996611 9.42186 0.667719 10.0613C0.338822 10.7007 0.239571 11.4338 0.386581 12.1376C0.53359 12.8415 0.917938 13.4735 1.47528 13.9279C2.03262 14.3822 2.72913 14.6313 3.44819 14.6335H4.7031V8.35898H3.44819V7.73153C3.44819 6.56667 3.91094 5.4495 4.73463 4.62581C5.55832 3.80212 6.67547 3.33938 7.84035 3.33938C9.00522 3.33938 10.1224 3.80212 10.9461 4.62581C11.7697 5.4495 12.2325 6.56667 12.2325 7.73153V8.35898H10.9776V13.3786H8.4678V14.6335H12.2325C12.9516 14.6313 13.648 14.3822 14.2054 13.9279C14.7628 13.4735 15.1471 12.8415 15.2942 12.1376C15.4412 11.4338 15.3419 10.7007 15.0129 10.0613C14.6841 9.42186 14.1455 8.91481 13.4874 8.62503ZM3.44819 13.3786C2.94896 13.3786 2.47017 13.1802 2.11717 12.8273C1.76416 12.4743 1.56583 11.9955 1.56583 11.4963C1.56583 10.997 1.76416 10.5182 2.11717 10.1652C2.47017 9.81221 2.94896 9.61388 3.44819 9.61388V13.3786ZM12.2325 13.3786V9.61388C12.7317 9.61388 13.2105 9.81221 13.5635 10.1652C13.9166 10.5182 14.1149 10.997 14.1149 11.4963C14.1149 11.9955 13.9166 12.4743 13.5635 12.8273C13.2105 13.1802 12.7317 13.3786 12.2325 13.3786Z" fill="#3BB77E"/>
</g>
</svg>
