<svg width="16" height="17" viewBox="0 0 16 17" fill="none" xmlns="http://www.w3.org/2000/svg">
<g id="icon-clock.svg" clip-path="url(#clip0_6511_8885)">
<g id="Clip path group">
<mask id="mask0_6511_8885" style="mask-type:luminance" maskUnits="userSpaceOnUse" x="0" y="1" width="16" height="16">
<g id="clip0">
<path id="Vector" d="M15.7424 1.23828H0.683594V16.2971H15.7424V1.23828Z" fill="white"/>
</g>
</mask>
<g mask="url(#mask0_6511_8885)">
<g id="Group">
<path id="Vector_2" d="M6.9581 16.2971H0.683594V15.0422H6.9581V16.2971ZM5.7032 12.5324H0.683594V13.7873H5.7032V12.5324ZM4.4483 10.0226H0.683594V11.2775H4.4483V10.0226ZM8.21301 1.23828C6.21675 1.24044 4.30286 2.0344 2.8913 3.44598C1.47972 4.85755 0.685753 6.77143 0.683594 8.76769H1.9385C1.9385 7.52672 2.30649 6.3136 2.99595 5.28176C3.6854 4.24992 4.66534 3.44571 5.81185 2.9708C6.95837 2.4959 8.21996 2.37165 9.43714 2.61375C10.6543 2.85585 11.7723 3.45344 12.6498 4.33094C13.5273 5.20845 14.1249 6.32646 14.3669 7.5436C14.6091 8.76073 14.4848 10.0223 14.0099 11.1689C13.535 12.3153 12.7308 13.2953 11.699 13.9848C10.6671 14.6742 9.45399 15.0422 8.21301 15.0422V16.2971C10.2099 16.2971 12.125 15.5039 13.5371 14.0918C14.9491 12.6798 15.7425 10.7647 15.7425 8.76769C15.7425 6.77077 14.9491 4.85564 13.5371 3.44359C12.125 2.03155 10.2099 1.23828 8.21301 1.23828ZM7.58556 5.63044V9.02746L9.65173 11.0937L10.539 10.2064L8.84045 8.50793V5.63044H7.58556Z" fill="#3BB77E"/>
</g>
</g>
</g>
</g>
<defs>
<clipPath id="clip0_6511_8885">
<rect width="16" height="16" fill="white" transform="translate(0 0.419922)"/>
</clipPath>
</defs>
</svg>
