<svg width="30" height="31" viewBox="0 0 30 31" fill="none" xmlns="http://www.w3.org/2000/svg">
<g id="category-5.svg" clip-path="url(#clip0_6511_4379)">
<path id="Vector" d="M22.125 20.89H15.375C14.1324 20.89 13.125 21.8974 13.125 23.14V27.64C13.125 28.8827 14.1324 29.89 15.375 29.89H22.125C23.3676 29.89 24.375 28.8827 24.375 27.64V23.14C24.375 21.8974 23.3676 20.89 22.125 20.89Z" fill="#FDC040"/>
<path id="Vector_2" d="M2.25 3.45251L2.625 4.39001L3.75 4.01501L6 3.82751L9.5625 3.64001L13.3125 3.82751L19.6875 4.39001L20.25 3.82751L20.625 2.89001C20.6875 2.64001 20.8125 2.10251 20.8125 1.95251C20.8125 1.80251 20.3125 1.76501 20.0625 1.76501L19.5 1.95251L18.9375 2.14001H17.8125C17.625 1.95251 17.2125 1.57751 17.0625 1.57751C16.9125 1.57751 16.625 1.32751 16.5 1.20251H15.5625L15 1.76501L14.25 2.14001H13.5L12.5625 1.57751L11.625 1.01501L10.6875 1.20251L10.125 1.76501L9.1875 2.14001L8.25 1.95251C8.0625 1.89001 7.65 1.76501 7.5 1.76501C7.35 1.76501 7.18751 1.39001 7.125 1.20251H6.5625L5.8125 1.39001C5.68751 1.51501 5.4 1.76501 5.25 1.76501C5.0625 1.76501 4.6875 1.95251 4.6875 2.14001C4.6875 2.32751 4.125 2.14001 3.9375 2.14001C3.75 2.14001 3.5625 2.14001 3.375 1.95251C3.225 1.80251 2.9375 1.76501 2.8125 1.76501H2.0625L1.875 2.51501L2.25 3.45251Z" fill="#FDC040"/>
<path id="Vector_3" d="M11.3001 19.9025C13.2883 19.9025 15.1623 19.3214 16.5771 18.2663C18.0304 17.1823 18.8308 15.729 18.8308 14.1742C18.8308 12.6193 18.0304 11.166 16.5771 10.0821C15.1623 9.0269 13.2883 8.4458 11.3001 8.4458C9.31196 8.4458 7.43797 9.0269 6.02321 10.0821C4.56993 11.166 3.76953 12.6193 3.76953 14.1742C3.76953 15.729 4.56989 17.1823 6.02321 18.2663C7.43797 19.3214 9.31196 19.9025 11.3001 19.9025ZM4.64846 14.1742C4.64846 11.5002 7.63241 9.32473 11.3001 9.32473C14.9679 9.32473 17.9518 11.5002 17.9518 14.1742C17.9518 16.8481 14.9679 19.0236 11.3001 19.0236C7.63241 19.0236 4.64846 16.8481 4.64846 14.1742Z" fill="#3BB77E"/>
<path id="Vector_4" d="M27.8204 26.4048C28.1864 26.1208 28.3855 25.7703 28.3855 25.3871C28.3855 25.004 28.1864 24.6534 27.8204 24.3694C28.1407 24.1473 28.3581 23.8904 28.4698 23.601C28.5671 23.3488 28.6292 22.9425 28.372 22.4391C28.1715 22.0469 27.8541 21.7924 27.4538 21.7031C26.8126 21.56 25.9635 21.8487 24.9253 22.5613C24.4349 21.2258 23.1858 20.2696 21.6889 20.2018C21.3749 20.1876 21.06 20.1764 20.7449 20.1667C21.0477 14.9357 20.9516 9.63604 20.4582 4.40288C20.6206 4.14124 20.9314 3.56197 21.1265 2.69851C21.244 2.17877 21.0228 1.66753 20.5632 1.39606C20.1105 1.12881 19.5648 1.18096 19.173 1.52902C18.9763 1.70375 18.7904 1.81203 18.472 1.81203C18.0538 1.81203 17.8671 1.62892 17.5844 1.35177C17.261 1.03459 16.8586 0.640015 16.0815 0.640015C15.3044 0.640015 14.902 1.03459 14.5787 1.35165C14.296 1.6288 14.1093 1.81191 13.6912 1.81191C13.2731 1.81191 13.0864 1.6288 12.8037 1.35165C12.4803 1.03459 12.0779 0.640015 11.3008 0.640015C10.5237 0.640015 10.1214 1.03459 9.79812 1.35165C9.51545 1.6288 9.3287 1.81191 8.91061 1.81191C8.49256 1.81191 8.30588 1.6288 8.02313 1.35165C7.69988 1.03459 7.29751 0.640015 6.52043 0.640015C5.7434 0.640015 5.3411 1.03459 5.01781 1.35165C4.73514 1.6288 4.54846 1.81191 4.13052 1.81191C3.81222 1.81191 3.62636 1.70363 3.42972 1.52896C3.03807 1.18096 2.49255 1.12876 2.03979 1.39589C1.58011 1.66724 1.35898 2.17842 1.4764 2.69816C1.67152 3.56197 1.98248 4.14135 2.14491 4.40291C2.06891 5.20868 2.00071 6.03038 1.94287 6.85032C1.92576 7.09241 2.10817 7.30256 2.35028 7.31959C2.59351 7.33646 2.80252 7.15425 2.81963 6.91211C2.87348 6.14888 2.93594 5.38346 3.00584 4.63163C8.51225 3.96862 14.091 3.96862 19.5977 4.63163C20.076 9.78304 20.1653 14.9978 19.8657 20.1455C18.4766 20.1211 17.0823 20.1391 15.7013 20.2017C14.2043 20.2695 12.9552 21.2256 12.4648 22.5612C11.4266 21.8486 10.5775 21.5598 9.93631 21.7029C9.53607 21.7923 9.2186 22.0468 9.01816 22.439C8.76098 22.9424 8.82301 23.3486 8.92029 23.6009C9.00248 23.814 9.14255 24.0093 9.3383 24.1863C7.23545 24.1268 5.11006 23.9699 3.00584 23.7163C2.54148 18.7157 2.44228 13.6516 2.71111 8.6592C2.72418 8.41684 2.53825 8.20976 2.29591 8.19675C2.05209 8.1834 1.84654 8.36963 1.83342 8.61195C1.55872 13.7129 1.6656 18.8873 2.14971 23.9946C1.98858 24.2525 1.6734 24.8347 1.47658 25.7063C1.35892 26.2262 1.58005 26.7377 2.03991 27.0092C2.49249 27.2765 3.03825 27.2241 3.42972 26.8762C3.62665 26.7015 3.81264 26.5932 4.13064 26.5932C4.54884 26.5932 4.73562 26.7763 5.01834 27.0536C5.34174 27.3706 5.74415 27.7651 6.52126 27.7651C7.29845 27.7651 7.70086 27.3705 8.02426 27.0536C8.30693 26.7763 8.4938 26.5932 8.91192 26.5932C9.05367 26.5932 9.16899 26.6148 9.26971 26.6532C9.10962 26.8126 8.99236 26.9861 8.92013 27.1733C8.82286 27.4256 8.7608 27.8319 9.01797 28.3352C9.21841 28.7274 9.53588 28.9819 9.93616 29.0712C10.0427 29.0951 10.1549 29.1069 10.2728 29.1069C10.8646 29.1069 11.5989 28.8066 12.4644 28.2126C12.9547 29.5484 14.204 30.5047 15.7011 30.5724C16.6944 30.6174 17.6946 30.6399 18.695 30.6399C19.6952 30.6399 20.6956 30.6174 21.6888 30.5724C23.1858 30.5046 24.435 29.5484 24.9253 28.2125C25.7908 28.8066 26.5252 29.1068 27.1169 29.1068C27.2348 29.1068 27.3471 29.0949 27.4536 29.0712C27.8539 28.9818 28.1714 28.7274 28.3718 28.3351C28.629 27.8318 28.5669 27.4255 28.4696 27.1733C28.3582 26.8839 28.1407 26.6269 27.8204 26.4048ZM2.79561 3.77232C2.66043 3.52177 2.46694 3.09426 2.3337 2.5045C2.28536 2.29046 2.43859 2.18112 2.48664 2.15276C2.5447 2.11848 2.69611 2.05291 2.84605 2.1861C3.11061 2.42107 3.4957 2.69084 4.13052 2.69084C4.90752 2.69084 5.30986 2.29626 5.63319 1.9792C5.91579 1.70205 6.10254 1.51894 6.52047 1.51894C6.93849 1.51894 7.1252 1.70205 7.40791 1.9792C7.73112 2.29626 8.13353 2.69084 8.91061 2.69084C9.68772 2.69084 10.0901 2.29626 10.4134 1.9792C10.6961 1.70205 10.8828 1.51894 11.3008 1.51894C11.7189 1.51894 11.9057 1.70205 12.1883 1.9792C12.5117 2.29626 12.9141 2.69084 13.6912 2.69084C14.4683 2.69084 14.8707 2.29626 15.194 1.9792C15.4766 1.70205 15.6634 1.51894 16.0815 1.51894C16.4997 1.51894 16.6864 1.70205 16.9691 1.9792C17.2925 2.29626 17.6949 2.69084 18.4721 2.69084C19.1069 2.69084 19.4921 2.42112 19.7567 2.1861C19.9065 2.05297 20.0582 2.11842 20.1163 2.15282C20.1644 2.18123 20.3177 2.29057 20.2692 2.50468C20.136 3.09461 19.9424 3.52218 19.8076 3.77226C14.1615 3.08389 8.44104 3.08389 2.79561 3.77232ZM21.1631 29.7137C20.5713 29.736 19.9778 29.751 19.3835 29.7572C19.6462 27.8294 20.1338 25.8832 20.8365 23.9645C20.9199 23.7365 20.8029 23.4842 20.5749 23.4007C20.3469 23.3172 20.0947 23.4344 20.0111 23.6622C19.2721 25.6805 18.7631 27.7298 18.4959 29.7599C17.9052 29.7581 17.3148 29.7483 16.7259 29.7306C17.3215 25.399 18.9102 22.0689 19.4589 21.0176C20.0119 21.0241 20.5641 21.0381 21.1148 21.0585C20.9877 21.318 20.8381 21.6365 20.6759 22.007C20.5786 22.2293 20.6798 22.4885 20.9022 22.5858C20.9595 22.6109 21.0193 22.6228 21.0782 22.6228C21.2475 22.6228 21.4088 22.5245 21.481 22.3595C21.7125 21.8307 21.9165 21.4136 22.062 21.1296C22.5825 21.2318 23.0482 21.4788 23.4164 21.8273C22.7183 23.3903 21.6258 26.2544 21.1631 29.7137ZM7.40907 26.4258C7.12636 26.703 6.9395 26.8861 6.52137 26.8861C6.10321 26.8861 5.91642 26.703 5.63375 26.4259C5.31031 26.1088 4.9079 25.7142 4.13075 25.7142C3.49652 25.7142 3.11131 25.9838 2.84623 26.219C2.69634 26.3521 2.54494 26.2866 2.48693 26.2523C2.43876 26.2239 2.28548 26.1145 2.334 25.9001C2.4772 25.2658 2.69043 24.8188 2.82555 24.5786C4.89507 24.8302 6.98547 24.9918 9.05618 25.058C9.02247 25.1644 9.00473 25.2743 9.00473 25.3872C9.00473 25.5012 9.02277 25.6123 9.05723 25.7196C9.01017 25.7165 8.96213 25.7143 8.91215 25.7143C8.13488 25.7142 7.73247 26.1088 7.40907 26.4258ZM10.1278 28.2134C10.0307 28.1918 9.90575 28.1405 9.80086 27.9353C9.68221 27.7029 9.70943 27.5696 9.74037 27.4896C9.83138 27.2538 10.1633 27.0171 10.6749 26.8232C10.8473 26.7579 10.9606 26.5919 10.9587 26.4076C10.9568 26.2233 10.84 26.0597 10.6662 25.9981C10.1285 25.8072 9.88366 25.5476 9.88366 25.3871C9.88366 25.2266 10.1286 24.9669 10.6662 24.776C10.84 24.7144 10.9568 24.5508 10.9587 24.3665C10.9606 24.1821 10.8473 24.0162 10.6749 23.951C10.1633 23.757 9.83138 23.5205 9.74037 23.2845C9.70951 23.2045 9.68221 23.0712 9.80086 22.8389C9.90575 22.6336 10.0307 22.5824 10.1278 22.5607C10.3348 22.5145 10.946 22.5205 12.2568 23.4924C12.2529 23.5364 12.249 23.5805 12.2467 23.625C12.185 24.7942 12.185 25.9798 12.2467 27.1489C12.249 27.1935 12.2529 27.2375 12.2568 27.2816C10.9461 28.2535 10.3351 28.2596 10.1278 28.2134ZM13.1243 23.6714C13.1988 22.2581 14.3238 21.144 15.741 21.0798C15.7556 21.0791 15.7702 21.0788 15.7847 21.078C15.1817 22.3172 14.0558 24.9225 13.4241 28.2159C13.2513 27.8804 13.1454 27.5037 13.1243 27.1028C13.0643 25.9644 13.0643 24.8099 13.1243 23.6714ZM14.1586 29.1066C14.8103 25.1012 16.2782 22.0212 16.7859 21.0419C17.3482 21.0255 17.9118 21.0162 18.4757 21.0143C17.7821 22.4243 16.3872 25.6466 15.8434 29.6985C15.8093 29.697 15.7751 29.696 15.741 29.6945C15.1422 29.6673 14.5959 29.4522 14.1586 29.1066ZM24.2658 27.1028C24.1987 28.3763 23.2784 29.4065 22.0601 29.6449C22.4769 26.6955 23.3579 24.2074 24.014 22.6569C24.1583 22.9671 24.2467 23.3093 24.2658 23.6714C24.3258 24.8099 24.3258 25.9643 24.2658 27.1028ZM27.5893 27.9352C27.4844 28.1405 27.3594 28.1918 27.2624 28.2134C27.0553 28.2596 26.4441 28.2536 25.1334 27.2818C25.1373 27.2377 25.1412 27.1936 25.1435 27.1491C25.2052 25.9799 25.2052 24.7943 25.1435 23.6252C25.1412 23.5806 25.1373 23.5365 25.1334 23.4925C26.444 22.5207 27.0551 22.5146 27.2624 22.5608C27.3594 22.5825 27.4844 22.6337 27.5893 22.8389C27.708 23.0712 27.6807 23.2046 27.6497 23.2846C27.5588 23.5205 27.2268 23.7571 26.7152 23.951C26.5429 24.0163 26.4296 24.1822 26.4314 24.3666C26.4334 24.5509 26.5502 24.7144 26.7239 24.7761C27.2616 24.967 27.5065 25.2266 27.5065 25.3871C27.5065 25.5476 27.2616 25.8072 26.7239 25.9981C26.5502 26.0598 26.4334 26.2233 26.4314 26.4077C26.4295 26.592 26.5428 26.7579 26.7152 26.8233C27.2268 27.0171 27.5588 27.2538 27.6498 27.4897C27.6806 27.5696 27.708 27.7029 27.5893 27.9352Z" fill="#3BB77E"/>
<path id="Vector_5" d="M8.36066 12.7237C10.3119 12.4646 12.2903 12.4646 14.2413 12.7237C14.261 12.7263 14.2805 12.7276 14.2998 12.7276C14.5167 12.7276 14.7055 12.5669 14.7348 12.346C14.7668 12.1054 14.5977 11.8844 14.3571 11.8525C12.3294 11.5832 10.2729 11.5832 8.24494 11.8525C8.00434 11.8844 7.83518 12.1054 7.86716 12.346C7.89915 12.5865 8.12006 12.7556 8.36066 12.7237Z" fill="#3BB77E"/>
<path id="Vector_6" d="M14.7348 16.1168C14.7029 15.8763 14.4818 15.7073 14.2413 15.7391C12.2903 15.9983 10.3119 15.9983 8.36066 15.7391C8.12018 15.7072 7.89911 15.8763 7.86716 16.1168C7.83518 16.3574 8.00434 16.5784 8.24494 16.6103C9.25886 16.745 10.2799 16.8123 11.301 16.8123C12.3221 16.8123 13.3431 16.745 14.357 16.6103C14.5977 16.5784 14.7668 16.3574 14.7348 16.1168Z" fill="#3BB77E"/>
<path id="Vector_7" d="M15.9244 14.2313C15.9244 13.9886 15.7276 13.7919 15.4849 13.7919H7.11524C6.87251 13.7919 6.67578 13.9886 6.67578 14.2313C6.67578 14.474 6.87251 14.6708 7.11524 14.6708H15.4849C15.7276 14.6708 15.9244 14.474 15.9244 14.2313Z" fill="#3BB77E"/>
</g>
<defs>
<clipPath id="clip0_6511_4379">
<rect width="30" height="30" fill="white" transform="translate(0 0.640015)"/>
</clipPath>
</defs>
</svg>
