<svg width="17" height="17" viewBox="0 0 17 17" fill="none" xmlns="http://www.w3.org/2000/svg">
<g id="icon-twitter-white.svg">
<path id="Vector" d="M14.6836 5.14228C14.3223 5.31002 13.9094 5.41324 13.5223 5.47776C13.7159 5.45195 13.9868 5.10357 14.103 4.97453C14.2707 4.76808 14.4126 4.52292 14.4901 4.26486C14.503 4.23905 14.503 4.21324 14.4901 4.20034C14.4642 4.18744 14.4513 4.20034 14.4255 4.20034C13.9868 4.4326 13.5352 4.61324 13.0449 4.72937C13.0062 4.74228 12.9804 4.72937 12.9546 4.70357C12.9159 4.65195 12.8771 4.61324 12.8384 4.57453C12.632 4.40679 12.4126 4.26486 12.1675 4.16163C11.8449 4.0326 11.4836 3.96808 11.1352 3.99389C10.7997 4.0197 10.4642 4.11002 10.1675 4.26486C9.8707 4.4197 9.59973 4.63905 9.38037 4.91002C9.16102 5.18099 8.99328 5.50357 8.91586 5.85195C8.83844 6.18744 8.83844 6.51002 8.89005 6.8455C8.90295 6.89711 8.89005 6.91002 8.83844 6.89711C6.92876 6.62615 5.35457 5.95518 4.07715 4.49711C4.02553 4.4326 3.98682 4.4326 3.94811 4.49711C3.39328 5.33582 3.66424 6.67776 4.36102 7.34873C4.45134 7.43905 4.55457 7.52937 4.65779 7.60679C4.61908 7.6197 4.15457 7.56808 3.74166 7.34873C3.69005 7.31002 3.66424 7.33582 3.65134 7.40034C3.65134 7.49066 3.65134 7.56808 3.66424 7.67131C3.76747 8.52292 4.36102 9.31002 5.16102 9.60679C5.25134 9.6455 5.36747 9.68421 5.47069 9.69711C5.29005 9.73582 5.0965 9.76163 4.56747 9.72292C4.50295 9.71002 4.47715 9.74873 4.50295 9.80034C4.89005 10.8842 5.74166 11.2068 6.38682 11.3874C6.47715 11.4003 6.55457 11.4003 6.64489 11.4261C6.64489 11.4391 6.63199 11.4391 6.63199 11.4391C6.42553 11.7616 5.69005 12.0068 5.34166 12.1229C4.72231 12.3423 4.03844 12.4326 3.38037 12.3681C3.27715 12.3552 3.25134 12.3552 3.22553 12.3681C3.19973 12.381 3.22553 12.4068 3.25134 12.4326C3.38037 12.5229 3.52231 12.6003 3.66424 12.6778C4.07715 12.8971 4.51586 13.0778 4.96747 13.2068C7.31586 13.852 9.97392 13.3745 11.7417 11.6197C13.1223 10.252 13.6126 8.35518 13.6126 6.4455C13.6126 6.36808 13.703 6.32937 13.7546 6.29066C14.1159 6.0197 14.3997 5.69711 14.6707 5.33582C14.7352 5.2584 14.7223 5.18099 14.7223 5.15518V5.14228C14.7223 5.11647 14.7352 5.11647 14.6836 5.14228Z" fill="white"/>
<path id="Vector_2" fill-rule="evenodd" clip-rule="evenodd" d="M6.63193 13.4523C6.67064 13.4523 7.59967 13.4523 6.63193 13.4523C6.61903 13.4523 6.76096 13.4523 6.63193 13.4523ZM6.63193 13.4523C6.43838 13.4523 6.61903 13.4523 6.63193 13.4523V13.4523ZM7.01903 13.4652C7.01903 13.4394 7.22548 13.4652 7.01903 13.4652C7.01903 13.4523 7.04483 13.4652 7.01903 13.4652ZM11.0964 4.02002C11.0835 4.03292 11.0706 4.03292 11.0448 4.02002C11.0577 4.02002 11.0835 4.02002 11.0964 4.02002Z" fill="white"/>
</g>
</svg>
