{
  "info": {
    "title": "test-shop",
    "version": "0.0.0"
  },
  "basePath": "/",
  "produces": [
    "application/json"
  ],
  "swagger": "2.0",
  "paths": {
    "/report/wishlist": {
      "get": {
        "description": "Returns list of statistics data by products",
        "summary": "list of statistics data by products",
        "tags": [
          "report"
        ],
        "parameters": [
          {
            "name": "start",
            "in": "query",
            "description": "Date start",
            "required": false,
            "type": "string",
            "format": "date"
          },
          {
            "name": "end",
            "in": "query",
            "description": "Date end",
            "required": false,
            "type": "string",
            "format": "date"
          }
        ],
        "responses": {
          "200": {
            "description": "statistic objects",
            "schema": {
              "type": "array",
              "items": {
                "type": "object",
                "properties": {
                  "id": {
                    "type": "integer",
                    "format": "int64"
                  },
                  "title": {
                    "type": "string"
                  },
                  "price": {
                    "type": "number"
                  },
                  "count": {
                    "type": "integer"
                  }
                }
              }
            }
          }
        }
      }
    }
  },
  "definitions": {},
  "responses": {},
  "parameters": {},
  "securityDefinitions": {},
  "tags": []
}