{
  "info": {
    "title": "analytics",
    "version": "0.0.1",
    "description": "Analytics Service."
  },
  "basePath": "/",
  "produces": [
    "application/json"
  ],
  "authorizations": {},
  "securityDefinitions": {
    "bearer": {
      "type": "apiKey",
      "name": "Authorization",
      "in": "header",
      "bearerFormat": "JWT"
    }
  },
  "swagger": "2.0",
  "paths": {
    "/account/login": {
      "post": {
        "description": "Login and get token",
        "summary": "get JWT token",
        "tags": [
          "account"
        ],
        "produces": [
          "application/json"
        ],
        "parameters": [
          {
            "name": "email",
            "description": "User email",
            "in": "formData",
            "required": true,
            "type": "string"
          },
          {
            "name": "password",
            "description": "User password",
            "in": "formData",
            "required": true,
            "type": "string"
          }
        ],
        "responses": {
          "200": {
            "description": "inserted object"
          }
        }
      }
    },
    "/statistics/page-clicks": {
      "post": {
        "description": "Tracking page click statistic",
        "summary": "add click statistic data",
        "tags": [
          "statistic_clicks"
        ],
        "security": [
          {
            "bearer": []
          }
        ],
        "produces": [
          "application/json"
        ],
        "parameters": [
          {
            "name": "user_id",
            "description": "User ID.",
            "in": "formData",
            "required": false,
            "type": "string"
          },
          {
            "name": "page_id",
            "description": "Page ID.",
            "in": "formData",
            "required": true,
            "type": "string"
          },
          {
            "name": "timestamp",
            "description": "Unix timestamp.",
            "in": "formData",
            "required": false,
            "type": "integer"
          }
        ],
        "responses": {
          "200": {
            "description": "inserted object"
          }
        }
      }
    },
    "/statistics/page-clicks/by-pages": {
      "get": {
        "description": "Returns list of statistics data by pages",
        "summary": "list of statistics data by pages",
        "tags": [
          "statistic_clicks"
        ],
        "security": [
          {
            "bearer": []
          }
        ],
        "parameters": [
          {
            "name": "start",
            "in": "query",
            "description": "Date start",
            "required": false,
            "type": "string",
            "format": "date"
          },
          {
            "name": "end",
            "in": "query",
            "description": "Date end",
            "required": false,
            "type": "string",
            "format": "date"
          }
        ],
        "responses": {
          "200": {
            "description": "statistic objects",
            "schema": {
              "type": "array",
              "items": {
                "type": "object",
                "properties": {
                  "id": {
                    "type": "integer",
                    "format": "int64"
                  },
                  "title": {
                    "type": "string"
                  },
                  "count": {
                    "type": "integer"
                  }
                }
              }
            }
          }
        }
      }
    },
    "/statistics/page-clicks/by-browsers": {
      "get": {
        "description": "Returns list of statistics data by browsers",
        "summary": "list of statistics data by browsers",
        "tags": [
          "statistic_clicks"
        ],
        "security": [
          {
            "bearer": []
          }
        ],
        "parameters": [
          {
            "name": "start",
            "in": "query",
            "description": "Date start",
            "required": false,
            "type": "string",
            "format": "date"
          },
          {
            "name": "end",
            "in": "query",
            "description": "Date end",
            "required": false,
            "type": "string",
            "format": "date"
          }
        ],
        "responses": {
          "200": {
            "description": "statistic objects",
            "schema": {
              "type": "array",
              "items": {
                "type": "object",
                "properties": {
                  "browser": {
                    "type": "string"
                  },
                  "count": {
                    "type": "integer"
                  }
                }
              }
            }
          }
        }
      }
    },
    "/statistics/page-clicks/by-countries": {
      "get": {
        "description": "Returns list of statistics data by countries",
        "summary": "list of statistics data by countries",
        "tags": [
          "statistic_clicks"
        ],
        "security": [
          {
            "bearer": []
          }
        ],
        "parameters": [
          {
            "name": "start",
            "in": "query",
            "description": "Date start",
            "required": false,
            "type": "string",
            "format": "date"
          },
          {
            "name": "end",
            "in": "query",
            "description": "Date end",
            "required": false,
            "type": "string",
            "format": "date"
          }
        ],
        "responses": {
          "200": {
            "description": "statistic objects",
            "schema": {
              "type": "array",
              "items": {
                "type": "object",
                "properties": {
                  "country": {
                    "type": "string"
                  },
                  "count": {
                    "type": "integer"
                  }
                }
              }
            }
          }
        }
      }
    },
    "/statistics/page-clicks/by-users": {
      "get": {
        "description": "Returns list of statistics data by users",
        "summary": "list of statistics data by users",
        "tags": [
          "statistic_clicks"
        ],
        "security": [
          {
            "bearer": []
          }
        ],
        "parameters": [
          {
            "name": "start",
            "in": "query",
            "description": "Date start",
            "required": false,
            "type": "string",
            "format": "date"
          },
          {
            "name": "end",
            "in": "query",
            "description": "Date end",
            "required": false,
            "type": "string",
            "format": "date"
          }
        ],
        "responses": {
          "200": {
            "description": "statistic objects",
            "schema": {
              "type": "array",
              "items": {
                "type": "object",
                "properties": {
                  "count": {
                    "type": "integer"
                  },
                  "user": {
                    "type": "object",
                    "properties": {
                      "name": {
                        "type": "string"
                      },
                      "email": {
                        "type": "string"
                      }
                    }
                  }
                }
              }
            }
          }
        }
      }
    },
    "/statistics/page-views": {
      "post": {
        "description": "Tracking page view statistic",
        "summary": "add view statistic data",
        "tags": [
          "statistic"
        ],
        "security": [
          {
            "bearer": []
          }
        ],
        "produces": [
          "application/json"
        ],
        "parameters": [
          {
            "name": "page_id",
            "description": "Page ID.",
            "in": "formData",
            "required": true,
            "type": "integer"
          },
          {
            "name": "timestamp",
            "description": "Unix timestamp.",
            "in": "formData",
            "required": false,
            "type": "integer"
          }
        ],
        "responses": {
          "200": {
            "description": "inserted object"
          }
        }
      }
    },
    "/statistics/page-views/by-pages": {
      "get": {
        "description": "Returns list of statistics data by pages",
        "summary": "list of statistics data by pages",
        "tags": [
          "statistic"
        ],
        "security": [
          {
            "bearer": []
          }
        ],
        "parameters": [
          {
            "name": "start",
            "in": "query",
            "description": "Date start",
            "required": false,
            "type": "string",
            "format": "date"
          },
          {
            "name": "end",
            "in": "query",
            "description": "Date end",
            "required": false,
            "type": "string",
            "format": "date"
          }
        ],
        "responses": {
          "200": {
            "description": "statistic objects",
            "schema": {
              "type": "array",
              "items": {
                "type": "object",
                "properties": {
                  "id": {
                    "type": "integer",
                    "format": "int64"
                  },
                  "title": {
                    "type": "string"
                  },
                  "count": {
                    "type": "integer"
                  }
                }
              }
            }
          }
        }
      }
    },
    "/statistics/page-views/by-browsers": {
      "get": {
        "description": "Returns list of statistics data by browsers",
        "summary": "list of statistics data by browsers",
        "tags": [
          "statistic"
        ],
        "security": [
          {
            "bearer": []
          }
        ],
        "parameters": [
          {
            "name": "start",
            "in": "query",
            "description": "Date start",
            "required": false,
            "type": "string",
            "format": "date"
          },
          {
            "name": "end",
            "in": "query",
            "description": "Date end",
            "required": false,
            "type": "string",
            "format": "date"
          }
        ],
        "responses": {
          "200": {
            "description": "statistic objects",
            "schema": {
              "type": "array",
              "items": {
                "type": "object",
                "properties": {
                  "browser": {
                    "type": "string"
                  },
                  "count": {
                    "type": "integer"
                  }
                }
              }
            }
          }
        }
      }
    },
    "/statistics/page-views/by-countries": {
      "get": {
        "description": "Returns list of statistics data by countries",
        "summary": "list of statistics data by countries",
        "tags": [
          "statistic"
        ],
        "security": [
          {
            "bearer": []
          }
        ],
        "parameters": [
          {
            "name": "start",
            "in": "query",
            "description": "Date start",
            "required": false,
            "type": "string",
            "format": "date"
          },
          {
            "name": "end",
            "in": "query",
            "description": "Date end",
            "required": false,
            "type": "string",
            "format": "date"
          }
        ],
        "responses": {
          "200": {
            "description": "statistic objects",
            "schema": {
              "type": "array",
              "items": {
                "type": "object",
                "properties": {
                  "country": {
                    "type": "string"
                  },
                  "count": {
                    "type": "integer"
                  }
                }
              }
            }
          }
        }
      }
    },
    "/statistics/page-views/by-users": {
      "get": {
        "description": "Returns list of statistics data by users",
        "summary": "list of statistics data by users",
        "tags": [
          "statistic"
        ],
        "security": [
          {
            "bearer": []
          }
        ],
        "parameters": [
          {
            "name": "start",
            "in": "query",
            "description": "Date start",
            "required": false,
            "type": "string",
            "format": "date"
          },
          {
            "name": "end",
            "in": "query",
            "description": "Date end",
            "required": false,
            "type": "string",
            "format": "date"
          }
        ],
        "responses": {
          "200": {
            "description": "statistic objects",
            "schema": {
              "type": "array",
              "items": {
                "type": "object",
                "properties": {
                  "count": {
                    "type": "integer"
                  },
                  "user": {
                    "type": "object",
                    "properties": {
                      "name": {
                        "type": "string"
                      },
                      "email": {
                        "type": "string"
                      }
                    }
                  }
                }
              }
            }
          }
        }
      }
    }
  },
  "definitions": {},
  "responses": {},
  "parameters": {},
  "tags": []
}