// Jest Snapshot v1, https://goo.gl/fbAQLP

exports[`Renders components Map component 1`] = `ShallowWrapper {}`;

exports[`Renders components Map component invalid URL 1`] = `ShallowWrapper {}`;

exports[`Renders page views About page 1`] = `ShallowWrapper {}`;

exports[`Renders page views Home page 1`] = `ShallowWrapper {}`;

exports[`Renders page views Lodge instance page 1`] = `ShallowWrapper {}`;

exports[`Renders page views Lodge splash page 1`] = `ShallowWrapper {}`;

exports[`Renders page views Park instance page 1`] = `ShallowWrapper {}`;

exports[`Renders page views Parks splash page 1`] = `ShallowWrapper {}`;

exports[`Renders page views Search page 1`] = `ShallowWrapper {}`;

exports[`Renders page views Trail instance page 1`] = `ShallowWrapper {}`;

exports[`Renders page views Trails splash page 1`] = `ShallowWrapper {}`;
