<svg xmlns="http://www.w3.org/2000/svg" width="32" height="33" viewBox="0 0 32 33">
    <g fill="none" fill-rule="evenodd" stroke="#182842" stroke-linecap="round" stroke-linejoin="round" stroke-width="2">
        <path d="M22.263 11.862h1.842c1.017 0 1.842.825 1.842 1.842v14.737a1.843 1.843 0 0 1-1.842 1.842H7.526a1.843 1.843 0 0 1-1.842-1.842V13.704c0-1.017.825-1.842 1.842-1.842h1.842M15.816 2.651v12.895M11.21 7.257l4.606-4.605 4.605 4.605"/>
    </g>
</svg>
