<svg width="14" height="22" viewBox="0 0 14 22" xmlns="http://www.w3.org/2000/svg">
    <path d="m9.149 12.678 2.715 7.495L6.865 22 4.15 14.505 0 17.118 1.724 0 14 12.002l-4.85.676h-.001zm-.012 6.217-2.889-7.971 3.15-.438-6.001-5.867-.841 8.367 2.692-1.696 2.889 7.971 1-.366z" fill="#484848" fill-rule="nonzero"/>
</svg>
