<svg width="12" height="12" viewBox="0 0 12 12" xmlns="http://www.w3.org/2000/svg">
    <g fill="none" fill-rule="evenodd">
        <path d="M-3-3h17.788v17.788H-3z"/>
        <path d="m9.368 8.557 2.456 2.455-.812.812-2.455-2.456a5.162 5.162 0 0 1-8.38-4.031 5.162 5.162 0 0 1 5.16-5.16 5.162 5.162 0 0 1 4.03 8.38zm-1.15-.425a4.012 4.012 0 0 0-2.881-6.809 4.012 4.012 0 0 0-4.014 4.014 4.012 4.012 0 0 0 6.809 2.88l.086-.085zM4.763 4.763v-1.72H5.91v1.72h1.72V5.91H5.91v1.72H4.763V5.91h-1.72V4.763h1.72z" fill="#484848" fill-rule="nonzero"/>
    </g>
</svg>
