<svg width="40" height="42" viewBox="0 0 22 20" xmlns="http://www.w3.org/2000/svg">
    <path d="M1.1 15.584c.608 0 1.1-.494 1.1-1.103V7.727c0-.608.493-1.104 1.1-1.104h1.1v10.065A3.31 3.31 0 0 0 7.7 20h6.6a3.31 3.31 0 0 0 3.3-3.312V6.623h1.1c.607 0 1.1.496 1.1 1.104v6.754c0 .609.492 1.103 1.1 1.103.608 0 1.1-.494 1.1-1.103V7.727a3.307 3.307 0 0 0-2.2-3.108V3.312A3.31 3.31 0 0 0 16.5 0h-11a3.31 3.31 0 0 0-3.3 3.312v1.307A3.307 3.307 0 0 0 0 7.727v6.754c0 .609.492 1.103 1.1 1.103zm14.3 1.104c0 .608-.493 1.104-1.1 1.104H7.7c-.607 0-1.1-.496-1.1-1.104V6.623h8.8v10.065zM4.4 3.312c0-.608.493-1.104 1.1-1.104h11c.607 0 1.1.496 1.1 1.104v1.104H4.4V3.312z" fill="#484848" fill-rule="nonzero"/>
</svg>
