{
  "images" : [
    {
      "filename" : "icons8-bell-24.png",
      "idiom" : "universal",
      "scale" : "1x"
    },
    {
      "filename" : "icons8-bell_48@2x.png",
      "idiom" : "universal",
      "scale" : "2x"
    },
    {
      "filename" : "icons8-bell_72@3x.png",
      "idiom" : "universal",
      "scale" : "3x"
    }
  ],
  "info" : {
    "author" : "xcode",
    "version" : 1
  }
}
