{
  "fileServerFolder": ".",
  "fixturesFolder": "./src/fixtures",
  "integrationFolder": "./src/integration",
  "modifyObstructiveCode": false,
  "pluginsFile": "./src/plugins/index",
  "supportFile": "./src/support/index.ts",
  "video": true,
  "videosFolder": "../../dist/cypress/apps/smart-sales-e2e/videos",
  "screenshotsFolder": "../../dist/cypress/apps/smart-sales-e2e/screenshots",
  "chromeWebSecurity": false
}
