module gitlab.com/shadowy/go/elasticsearch-zeebe

go 1.18

require (
	github.com/elastic/elastic-transport-go/v8 v8.1.0 // indirect
	github.com/elastic/go-elasticsearch/v8 v8.2.0 // indirect
	github.com/rs/zerolog v1.26.1 // indirect
)
