{
    "swagger": "2.0",
    "info": {
        "description": "This is a Deploy API Server",
        "title": "Swagger Deploy API",
        "contact": {},
        "version": "1.0"
    },
    "basePath": "/",
    "paths": {
        "/application": {
            "get": {
                "description": "Get applications list",
                "consumes": [
                    "application/json"
                ],
                "produces": [
                    "application/json"
                ],
                "tags": [
                    "Application"
                ],
                "parameters": [
                    {
                        "type": "integer",
                        "description": "Offset",
                        "name": "offset",
                        "in": "query"
                    },
                    {
                        "type": "integer",
                        "description": "Limit",
                        "name": "limit",
                        "in": "query"
                    },
                    {
                        "type": "string",
                        "description": "order",
                        "name": "order",
                        "in": "query"
                    },
                    {
                        "type": "string",
                        "description": "Text for search",
                        "name": "text",
                        "in": "query"
                    }
                ],
                "responses": {
                    "200": {
                        "description": "Applications list",
                        "schema": {
                            "type": "array",
                            "items": {
                                "$ref": "#/definitions/model.Application"
                            }
                        }
                    },
                    "406": {
                        "description": "Invalid parameters",
                        "schema": {
                            "$ref": "#/definitions/response.Error"
                        }
                    },
                    "500": {
                        "description": "Internal error",
                        "schema": {
                            "$ref": "#/definitions/response.Error"
                        }
                    }
                }
            },
            "post": {
                "description": "Create application",
                "consumes": [
                    "application/json"
                ],
                "produces": [
                    "application/json"
                ],
                "tags": [
                    "Application"
                ],
                "parameters": [
                    {
                        "description": "Application",
                        "name": "data",
                        "in": "body",
                        "required": true,
                        "schema": {
                            "$ref": "#/definitions/model.Application"
                        }
                    }
                ],
                "responses": {
                    "204": {
                        "description": ""
                    },
                    "404": {
                        "description": "Internal error",
                        "schema": {
                            "$ref": "#/definitions/response.Error"
                        }
                    },
                    "500": {
                        "description": "Internal error",
                        "schema": {
                            "$ref": "#/definitions/response.Error"
                        }
                    }
                }
            }
        },
        "/application/{id}": {
            "get": {
                "description": "Get application",
                "consumes": [
                    "application/json"
                ],
                "produces": [
                    "application/json"
                ],
                "tags": [
                    "Application"
                ],
                "parameters": [
                    {
                        "type": "string",
                        "description": "Application ID",
                        "name": "id",
                        "in": "path",
                        "required": true
                    }
                ],
                "responses": {
                    "200": {
                        "description": "Application",
                        "schema": {
                            "$ref": "#/definitions/model.Application"
                        }
                    },
                    "404": {
                        "description": "Internal error",
                        "schema": {
                            "$ref": "#/definitions/response.Error"
                        }
                    },
                    "500": {
                        "description": "Internal error",
                        "schema": {
                            "$ref": "#/definitions/response.Error"
                        }
                    }
                }
            },
            "put": {
                "description": "Update application",
                "consumes": [
                    "application/json"
                ],
                "produces": [
                    "application/json"
                ],
                "tags": [
                    "Application"
                ],
                "parameters": [
                    {
                        "type": "string",
                        "description": "Application ID",
                        "name": "id",
                        "in": "path",
                        "required": true
                    },
                    {
                        "description": "Application",
                        "name": "data",
                        "in": "body",
                        "required": true,
                        "schema": {
                            "$ref": "#/definitions/model.Application"
                        }
                    }
                ],
                "responses": {
                    "204": {
                        "description": ""
                    },
                    "404": {
                        "description": "Internal error",
                        "schema": {
                            "$ref": "#/definitions/response.Error"
                        }
                    },
                    "500": {
                        "description": "Internal error",
                        "schema": {
                            "$ref": "#/definitions/response.Error"
                        }
                    }
                }
            },
            "delete": {
                "description": "Delete application",
                "consumes": [
                    "application/json"
                ],
                "produces": [
                    "application/json"
                ],
                "tags": [
                    "Application"
                ],
                "parameters": [
                    {
                        "type": "string",
                        "description": "Application ID",
                        "name": "id",
                        "in": "path",
                        "required": true
                    }
                ],
                "responses": {
                    "204": {
                        "description": ""
                    },
                    "404": {
                        "description": "Internal error",
                        "schema": {
                            "$ref": "#/definitions/response.Error"
                        }
                    },
                    "500": {
                        "description": "Internal error",
                        "schema": {
                            "$ref": "#/definitions/response.Error"
                        }
                    }
                }
            }
        },
        "/repository": {
            "get": {
                "description": "Get repository list",
                "consumes": [
                    "application/json"
                ],
                "produces": [
                    "application/json"
                ],
                "tags": [
                    "Repository"
                ],
                "parameters": [
                    {
                        "type": "integer",
                        "description": "Offset",
                        "name": "offset",
                        "in": "query"
                    },
                    {
                        "type": "integer",
                        "description": "Limit",
                        "name": "limit",
                        "in": "query"
                    },
                    {
                        "type": "string",
                        "description": "order",
                        "name": "order",
                        "in": "query"
                    },
                    {
                        "type": "string",
                        "description": "Text for search",
                        "name": "text",
                        "in": "query"
                    }
                ],
                "responses": {
                    "200": {
                        "description": "Repositories list",
                        "schema": {
                            "type": "array",
                            "items": {
                                "$ref": "#/definitions/model.Repository"
                            }
                        }
                    },
                    "406": {
                        "description": "Invalid parameters",
                        "schema": {
                            "$ref": "#/definitions/response.Error"
                        }
                    },
                    "500": {
                        "description": "Internal error",
                        "schema": {
                            "$ref": "#/definitions/response.Error"
                        }
                    }
                }
            },
            "post": {
                "description": "Create repository",
                "consumes": [
                    "application/json"
                ],
                "produces": [
                    "application/json"
                ],
                "tags": [
                    "Repository"
                ],
                "parameters": [
                    {
                        "description": "Repository",
                        "name": "data",
                        "in": "body",
                        "required": true,
                        "schema": {
                            "$ref": "#/definitions/model.Repository"
                        }
                    }
                ],
                "responses": {
                    "204": {
                        "description": ""
                    },
                    "404": {
                        "description": "Internal error",
                        "schema": {
                            "$ref": "#/definitions/response.Error"
                        }
                    },
                    "500": {
                        "description": "Internal error",
                        "schema": {
                            "$ref": "#/definitions/response.Error"
                        }
                    }
                }
            }
        },
        "/repository/{id}": {
            "get": {
                "description": "Get repository",
                "consumes": [
                    "application/json"
                ],
                "produces": [
                    "application/json"
                ],
                "tags": [
                    "Repository"
                ],
                "parameters": [
                    {
                        "type": "string",
                        "description": "Repository ID",
                        "name": "id",
                        "in": "path",
                        "required": true
                    }
                ],
                "responses": {
                    "200": {
                        "description": "Repository",
                        "schema": {
                            "$ref": "#/definitions/model.Repository"
                        }
                    },
                    "404": {
                        "description": "Internal error",
                        "schema": {
                            "$ref": "#/definitions/response.Error"
                        }
                    },
                    "500": {
                        "description": "Internal error",
                        "schema": {
                            "$ref": "#/definitions/response.Error"
                        }
                    }
                }
            },
            "put": {
                "description": "Update repository",
                "consumes": [
                    "application/json"
                ],
                "produces": [
                    "application/json"
                ],
                "tags": [
                    "Repository"
                ],
                "parameters": [
                    {
                        "type": "string",
                        "description": "Repository ID",
                        "name": "id",
                        "in": "path",
                        "required": true
                    },
                    {
                        "description": "Repository",
                        "name": "data",
                        "in": "body",
                        "required": true,
                        "schema": {
                            "$ref": "#/definitions/model.Repository"
                        }
                    }
                ],
                "responses": {
                    "204": {
                        "description": ""
                    },
                    "404": {
                        "description": "Internal error",
                        "schema": {
                            "$ref": "#/definitions/response.Error"
                        }
                    },
                    "500": {
                        "description": "Internal error",
                        "schema": {
                            "$ref": "#/definitions/response.Error"
                        }
                    }
                }
            },
            "delete": {
                "description": "Delete repository",
                "consumes": [
                    "application/json"
                ],
                "produces": [
                    "application/json"
                ],
                "tags": [
                    "Repository"
                ],
                "parameters": [
                    {
                        "type": "string",
                        "description": "Repository ID",
                        "name": "id",
                        "in": "path",
                        "required": true
                    }
                ],
                "responses": {
                    "204": {
                        "description": ""
                    },
                    "404": {
                        "description": "Internal error",
                        "schema": {
                            "$ref": "#/definitions/response.Error"
                        }
                    },
                    "500": {
                        "description": "Internal error",
                        "schema": {
                            "$ref": "#/definitions/response.Error"
                        }
                    }
                }
            }
        },
        "/server": {
            "get": {
                "description": "Get servers list",
                "consumes": [
                    "application/json"
                ],
                "produces": [
                    "application/json"
                ],
                "tags": [
                    "Server"
                ],
                "parameters": [
                    {
                        "type": "integer",
                        "description": "Offset",
                        "name": "offset",
                        "in": "query"
                    },
                    {
                        "type": "integer",
                        "description": "Limit",
                        "name": "limit",
                        "in": "query"
                    },
                    {
                        "type": "string",
                        "description": "order",
                        "name": "order",
                        "in": "query"
                    },
                    {
                        "type": "string",
                        "description": "Text for search",
                        "name": "text",
                        "in": "query"
                    }
                ],
                "responses": {
                    "200": {
                        "description": "Servers list",
                        "schema": {
                            "type": "array",
                            "items": {
                                "$ref": "#/definitions/model.Server"
                            }
                        }
                    },
                    "406": {
                        "description": "Invalid parameters",
                        "schema": {
                            "$ref": "#/definitions/response.Error"
                        }
                    },
                    "500": {
                        "description": "Internal error",
                        "schema": {
                            "$ref": "#/definitions/response.Error"
                        }
                    }
                }
            },
            "post": {
                "description": "Create server",
                "consumes": [
                    "application/json"
                ],
                "produces": [
                    "application/json"
                ],
                "tags": [
                    "Server"
                ],
                "parameters": [
                    {
                        "description": "Server",
                        "name": "data",
                        "in": "body",
                        "required": true,
                        "schema": {
                            "$ref": "#/definitions/model.Server"
                        }
                    }
                ],
                "responses": {
                    "204": {
                        "description": ""
                    },
                    "404": {
                        "description": "Internal error",
                        "schema": {
                            "$ref": "#/definitions/response.Error"
                        }
                    },
                    "500": {
                        "description": "Internal error",
                        "schema": {
                            "$ref": "#/definitions/response.Error"
                        }
                    }
                }
            }
        },
        "/server/{id}": {
            "get": {
                "description": "Get server",
                "consumes": [
                    "application/json"
                ],
                "produces": [
                    "application/json"
                ],
                "tags": [
                    "Server"
                ],
                "parameters": [
                    {
                        "type": "string",
                        "description": "Server ID",
                        "name": "id",
                        "in": "path",
                        "required": true
                    }
                ],
                "responses": {
                    "200": {
                        "description": "Server",
                        "schema": {
                            "$ref": "#/definitions/model.Server"
                        }
                    },
                    "404": {
                        "description": "Internal error",
                        "schema": {
                            "$ref": "#/definitions/response.Error"
                        }
                    },
                    "500": {
                        "description": "Internal error",
                        "schema": {
                            "$ref": "#/definitions/response.Error"
                        }
                    }
                }
            },
            "put": {
                "description": "Update server",
                "consumes": [
                    "application/json"
                ],
                "produces": [
                    "application/json"
                ],
                "tags": [
                    "Server"
                ],
                "parameters": [
                    {
                        "type": "string",
                        "description": "Server ID",
                        "name": "id",
                        "in": "path",
                        "required": true
                    },
                    {
                        "description": "Server",
                        "name": "data",
                        "in": "body",
                        "required": true,
                        "schema": {
                            "$ref": "#/definitions/model.Server"
                        }
                    }
                ],
                "responses": {
                    "204": {
                        "description": ""
                    },
                    "404": {
                        "description": "Internal error",
                        "schema": {
                            "$ref": "#/definitions/response.Error"
                        }
                    },
                    "500": {
                        "description": "Internal error",
                        "schema": {
                            "$ref": "#/definitions/response.Error"
                        }
                    }
                }
            },
            "delete": {
                "description": "Delete server",
                "consumes": [
                    "application/json"
                ],
                "produces": [
                    "application/json"
                ],
                "tags": [
                    "Server"
                ],
                "parameters": [
                    {
                        "type": "string",
                        "description": "Server ID",
                        "name": "id",
                        "in": "path",
                        "required": true
                    }
                ],
                "responses": {
                    "204": {
                        "description": ""
                    },
                    "404": {
                        "description": "Internal error",
                        "schema": {
                            "$ref": "#/definitions/response.Error"
                        }
                    },
                    "500": {
                        "description": "Internal error",
                        "schema": {
                            "$ref": "#/definitions/response.Error"
                        }
                    }
                }
            }
        }
    },
    "definitions": {
        "model.Application": {
            "type": "object",
            "properties": {
                "description": {
                    "type": "string"
                },
                "environments": {
                    "type": "array",
                    "items": {
                        "$ref": "#/definitions/model.Environment"
                    }
                },
                "id": {
                    "type": "string"
                },
                "name": {
                    "type": "string"
                },
                "services": {
                    "type": "array",
                    "items": {
                        "$ref": "#/definitions/model.Service"
                    }
                }
            }
        },
        "model.Environment": {
            "type": "object",
            "properties": {
                "description": {
                    "type": "string"
                },
                "id": {
                    "type": "string"
                },
                "name": {
                    "type": "string"
                },
                "server": {
                    "$ref": "#/definitions/model.Server"
                },
                "stack": {
                    "type": "string"
                }
            }
        },
        "model.Repository": {
            "type": "object",
            "properties": {
                "description": {
                    "type": "string"
                },
                "id": {
                    "type": "string"
                },
                "mask": {
                    "type": "string"
                },
                "name": {
                    "type": "string"
                },
                "password": {
                    "type": "string"
                },
                "url": {
                    "type": "string"
                },
                "user": {
                    "type": "string"
                }
            }
        },
        "model.Server": {
            "type": "object",
            "properties": {
                "description": {
                    "type": "string"
                },
                "id": {
                    "type": "string"
                },
                "name": {
                    "type": "string"
                },
                "token": {
                    "type": "string"
                },
                "url": {
                    "type": "string"
                }
            }
        },
        "model.Service": {
            "type": "object",
            "properties": {
                "code": {
                    "type": "string"
                },
                "description": {
                    "type": "string"
                },
                "id": {
                    "type": "string"
                },
                "name": {
                    "type": "string"
                }
            }
        },
        "response.Error": {
            "type": "object",
            "properties": {
                "error": {
                    "type": "string"
                }
            }
        }
    },
    "securityDefinitions": {
        "ApiKeyAuth": {
            "type": "apiKey",
            "name": "Authorization",
            "in": "header"
        }
    }
}