[LOG] System::create                           : Header version = 2.01.07. Current version = 2.01.07.
[LOG] Manager::init                            : maxchannels = 256 studioflags = 00000006 flags 00000000 extradriverdata 0x0.
[LOG] SystemI::init                            : Initialize version=20107 (113487), maxchannels=256, flags=0x00020000
[LOG] SystemI::setOutputInternal               : Setting output to 'FMOD Core Audio Output'
[LOG] OutputCoreAudio::init                    : Output running 2 channels at 44100Hz sample rate.
[LOG] OutputCoreAudio::init                    : Maximum hardware read size: 1024 samples, Software buffer size: 512 samples, Number of software buffers: 4.
[LOG] SystemI::init                            : Output requires a sample rate of 44100Hz, resampling will occur.
[LOG] Thread::initThread                       : Init FMOD stream thread. Affinity: 0x8000000000000003, Priority: 0xFFFF7FFB, Stack Size: 98304, Semaphore: No, Sleep Time: 10, Looping: Yes.
[LOG] Thread::initThread                       : Init FMOD mixer thread. Affinity: 0x8000000000000001, Priority: 0xFFFF7FFA, Stack Size: 81920, Semaphore: Yes, Sleep Time: 0, Looping: Yes.
[LOG] AsyncManager::init                       : manager 0x7fc333ad3608 isAsync 0 updatePeriod 0.02
[LOG] AsyncManager::init                       : done
[LOG] PlaybackSystem::init                     : 
[LOG] Thread::initThread                       : Init FMOD Studio sample load thread. Affinity: 0x8000000000000003, Priority: 0xFFFF7FFD, Stack Size: 98304, Semaphore: No, Sleep Time: 1, Looping: No.
[LOG] PlaybackSystem::init                     : done
[LOG] Thread::initThread                       : Init FMOD Studio bank load thread. Affinity: 0x8000000000000003, Priority: 0xFFFF7FFD, Stack Size: 98304, Semaphore: No, Sleep Time: 1, Looping: No.
[LOG] Manager::init                            : done.
[LOG] Manager::readBank                        : fileversion = 135, compatVersion = 132 (oldest = 44, newest = 135)
[LOG] Manager::readBank                        : fileversion = 135, compatVersion = 132 (oldest = 44, newest = 135)
[LOG] Manager::readBank                        : fileversion = 135, compatVersion = 132 (oldest = 44, newest = 135)
[LOG] SystemI::createSound                     : filename = Build/Desktop/Master.bank : mode 02010082
[LOG] SystemI::createSound                     : FMOD_NONBLOCKING specified.  Putting into queue to be opened asynchronously!
[LOG] SystemI::createSound                     : setdata soundi = 0x7fc351291e68 : node = 0x7fc331d875c0
[LOG] SystemI::createSound                     : add node to async list : head = 0x7fc35119f6f8.  list count = 0
[LOG] AsyncThread::threadFunc                  : Starting Asynchronous operation on sound 0x7fc351291e68
[LOG] SystemI::createSoundInternal             :     Create name='Build/Desktop/Master.bank', mode=0x02010082
[LOG] SystemI::createSound                     : filename = Build/Desktop/Master.bank : mode 02010082
[LOG] SystemI::createSound                     :     FMOD_NONBLOCKING specified.  Putting into queue to be opened asynchronously!
[LOG] SystemI::createSound                     :     setdata soundi = 0x7fc331d99408 : node = 0x7fc3512da4c0
[LOG] SystemI::createSound                     :     add node to async list : head = 0x7fc35119f6f8.  list count = 0
[LOG] SystemI::createSoundInternal             :     exinfo->cbsize             = 224
[LOG] SystemI::createSoundInternal             :     exinfo->length             = 3901056
[LOG] SystemI::createSoundInternal             :     exinfo->fileoffset         = 22432
[LOG] SystemI::createSoundInternal             :     exinfo->numsubsounds       = 1
[LOG] SystemI::createSoundInternal             :     exinfo->inclusionlist      = 0x7fc331d876d0
[LOG] SystemI::createSoundInternal             :     exinfo->inclusionlistnum   = 1
[LOG] SystemI::createSoundInternal             :     exinfo->suggestedsoundtype = 5
[LOG] SystemI::createSoundInternal             :     exinfo->initialseekpostype = 1
[LOG] SystemI::createSound                     :     filename = Build/Desktop/Master.bank : mode 02010082
[LOG] SystemI::createSound                     :     FMOD_NONBLOCKING specified.  Putting into queue to be opened asynchronously!
[LOG] SystemI::createSound                     :     setdata soundi = 0x7fc35d972938 : node = 0x7fc35d979bb0
[LOG] SystemI::createSound                     :     add node to async list : head = 0x7fc35119f6f8.  list count = 1
[LOG] SystemI::createSound                     :     filename = Build/Desktop/Master.bank : mode 02010082
[LOG] SystemI::createSound                     :     FMOD_NONBLOCKING specified.  Putting into queue to be opened asynchronously!
[LOG] SystemI::createSound                     :     setdata soundi = 0x7fc35d955fc8 : node = 0x7fc35eda6030
[LOG] SystemI::createSound                     :     add node to async list : head = 0x7fc35119f6f8.  list count = 2
[LOG] SystemI::createSoundInternal             :     Stream 0/1: name='OBJ-fire-torch-loop', format=5, channels=1, frequency=48000, lengthbytes=130048, lengthpcm=584456, pcmblocksize=0, loopstart=0, loopend=0, mode=0x00000000, channelmask=0x00000000, channelorder=0, peakvolume=0.639771.
[LOG] AsyncThread::threadFunc                  : Finished Asynchronous operation on sound 0x7fc351291e68
[LOG] AsyncThread::threadFunc                  : Starting Asynchronous operation on sound 0x7fc331d99408
[LOG] SystemI::createSoundInternal             :     Create name='Build/Desktop/Master.bank', mode=0x02010082
[LOG] SystemI::createSoundInternal             :     exinfo->cbsize             = 224
[LOG] SystemI::createSoundInternal             :     exinfo->length             = 3901056
[LOG] SystemI::createSoundInternal             :     exinfo->fileoffset         = 22432
[LOG] SystemI::createSoundInternal             :     exinfo->numsubsounds       = 1
[LOG] SystemI::createSoundInternal             :     exinfo->inclusionlist      = 0x7fc3512da5d0
[LOG] SystemI::createSoundInternal             :     exinfo->inclusionlistnum   = 1
[LOG] SystemI::createSoundInternal             :     exinfo->suggestedsoundtype = 5
[LOG] SystemI::createSoundInternal             :     exinfo->initialseekpostype = 1
[LOG] SystemI::createSoundInternal             :     Stream 0/1: name='OBJ-fire-torch-loop', format=5, channels=1, frequency=48000, lengthbytes=130048, lengthpcm=584456, pcmblocksize=0, loopstart=0, loopend=0, mode=0x00000000, channelmask=0x00000000, channelorder=0, peakvolume=0.639771.
[LOG] AsyncThread::threadFunc                  : Finished Asynchronous operation on sound 0x7fc331d99408
[LOG] AsyncThread::threadFunc                  : Starting Asynchronous operation on sound 0x7fc35d972938
[LOG] SystemI::createSoundInternal             :     Create name='Build/Desktop/Master.bank', mode=0x02010082
[LOG] SystemI::createSoundInternal             :     exinfo->cbsize             = 224
[LOG] SystemI::createSoundInternal             :     exinfo->length             = 3901056
[LOG] SystemI::createSoundInternal             :     exinfo->fileoffset         = 22432
[LOG] SystemI::createSoundInternal             :     exinfo->numsubsounds       = 1
[LOG] SystemI::createSoundInternal             :     exinfo->inclusionlist      = 0x7fc35d979cc0
[LOG] SystemI::createSoundInternal             :     exinfo->inclusionlistnum   = 1
[LOG] SystemI::createSoundInternal             :     exinfo->suggestedsoundtype = 5
[LOG] SystemI::createSoundInternal             :     exinfo->initialseekpostype = 1
[LOG] SystemI::createSoundInternal             :     Stream 0/1: name='OBJ-fire-torch-loop', format=5, channels=1, frequency=48000, lengthbytes=130048, lengthpcm=584456, pcmblocksize=0, loopstart=0, loopend=0, mode=0x00000000, channelmask=0x00000000, channelorder=0, peakvolume=0.639771.
[LOG] AsyncThread::threadFunc                  : Finished Asynchronous operation on sound 0x7fc35d972938
[LOG] AsyncThread::threadFunc                  : Starting Asynchronous operation on sound 0x7fc35d955fc8
[LOG] SystemI::createSoundInternal             :     Create name='Build/Desktop/Master.bank', mode=0x02010082
[LOG] SystemI::createSoundInternal             :     exinfo->cbsize             = 224
[LOG] SystemI::createSoundInternal             :     exinfo->length             = 3901056
[LOG] SystemI::createSoundInternal             :     exinfo->fileoffset         = 22432
[LOG] SystemI::createSoundInternal             :     exinfo->numsubsounds       = 1
[LOG] SystemI::createSoundInternal             :     exinfo->inclusionlist      = 0x7fc35eda6140
[LOG] SystemI::createSoundInternal             :     exinfo->inclusionlistnum   = 1
[LOG] SystemI::createSoundInternal             :     exinfo->suggestedsoundtype = 5
[LOG] SystemI::createSoundInternal             :     exinfo->initialseekpostype = 1
[LOG] SystemI::createSoundInternal             :     Stream 0/1: name='OBJ-fire-torch-loop', format=5, channels=1, frequency=48000, lengthbytes=130048, lengthpcm=584456, pcmblocksize=0, loopstart=0, loopend=0, mode=0x00000000, channelmask=0x00000000, channelorder=0, peakvolume=0.639771.
[LOG] AsyncThread::threadFunc                  : Finished Asynchronous operation on sound 0x7fc35d955fc8
[LOG] SoundI::release                          : OBJ-fire-torch-loop (0x7fc35d951038)
[LOG] SoundI::release                          :     OBJ-fire-torch-loop (0x7fc3312c0408)
[LOG] SoundI::release                          :     OBJ-fire-torch-loop (0x7fc35d965c98)
[LOG] SoundI::release                          : OBJ-fire-torch-loop (0x7fc35d968278)
[LOG] SoundI::release                          :     OBJ-fire-torch-loop (0x7fc332aad988)
[LOG] SoundI::release                          :     OBJ-fire-torch-loop (0x7fc332aac968)
[LOG] SoundI::release                          : OBJ-fire-torch-loop (0x7fc35d9f0c48)
[LOG] SoundI::release                          :     OBJ-fire-torch-loop (0x7fc3511729b8)
[LOG] SoundI::release                          :     OBJ-fire-torch-loop (0x7fc35d9c2668)
[LOG] SoundI::release                          : OBJ-fire-torch-loop (0x7fc3511a0a58)
[LOG] SoundI::release                          :     OBJ-fire-torch-loop (0x7fc332a37308)
[LOG] SoundI::release                          :     OBJ-fire-torch-loop (0x7fc3510e9da8)
[LOG] Manager::readBank                        : fileversion = 135, compatVersion = 132 (oldest = 44, newest = 135)
[LOG] Manager::readBank                        : fileversion = 135, compatVersion = 132 (oldest = 44, newest = 135)
[LOG] Manager::readBank                        : fileversion = 135, compatVersion = 132 (oldest = 44, newest = 135)
[LOG] PlaybackSystem::acquireMasterBus         : Setting master channel group format to 3
[LOG] SystemI::createSound                     : filename = Build/Desktop/Master.bank : mode 02010082
[LOG] SystemI::createSound                     : FMOD_NONBLOCKING specified.  Putting into queue to be opened asynchronously!
[LOG] SystemI::createSound                     : setdata soundi = 0x7fc3512d8908 : node = 0x7fc331d41520
[LOG] SystemI::createSound                     : add node to async list : head = 0x7fc35119f6f8.  list count = 0
[LOG] AsyncThread::threadFunc                  : Starting Asynchronous operation on sound 0x7fc3512d8908
[LOG] SystemI::createSoundInternal             :     Create name='Build/Desktop/Master.bank', mode=0x02010082
[LOG] SystemI::createSoundInternal             :     exinfo->cbsize             = 224
[LOG] SystemI::createSoundInternal             :     exinfo->length             = 3901056
[LOG] SystemI::createSoundInternal             :     exinfo->fileoffset         = 22432
[LOG] SystemI::createSoundInternal             :     exinfo->numsubsounds       = 1
[LOG] SystemI::createSoundInternal             :     exinfo->inclusionlist      = 0x7fc331d41630
[LOG] SystemI::createSoundInternal             :     exinfo->inclusionlistnum   = 1
[LOG] SystemI::createSoundInternal             :     exinfo->suggestedsoundtype = 5
[LOG] SystemI::createSoundInternal             :     exinfo->initialseekpostype = 1
[LOG] SystemI::createSound                     : filename = Build/Desktop/Master.bank : mode 02010082
[LOG] SystemI::createSound                     :     FMOD_NONBLOCKING specified.  Putting into queue to be opened asynchronously!
[LOG] SystemI::createSound                     :     setdata soundi = 0x7fc3511cfd48 : node = 0x7fc35d9e9650
[LOG] SystemI::createSound                     :     add node to async list : head = 0x7fc35119f6f8.  list count = 0
[LOG] SystemI::createSoundInternal             :     Stream 0/1: name='OBJ-fire-torch-loop', format=5, channels=1, frequency=48000, lengthbytes=130048, lengthpcm=584456, pcmblocksize=0, loopstart=0, loopend=0, mode=0x00000000, channelmask=0x00000000, channelorder=0, peakvolume=0.639771.
[LOG] SystemI::createSound                     :     filename = Build/Desktop/Master.bank : mode 02010082
[LOG] SystemI::createSound                     :     FMOD_NONBLOCKING specified.  Putting into queue to be opened asynchronously!
[LOG] SystemI::createSound                     :     setdata soundi = 0x7fc35d98f988 : node = 0x7fc3312d4ea0
[LOG] SystemI::createSound                     :     add node to async list : head = 0x7fc35119f6f8.  list count = 1
[LOG] SystemI::createSound                     :     filename = Build/Desktop/Master.bank : mode 02010082
[LOG] SystemI::createSound                     :     FMOD_NONBLOCKING specified.  Putting into queue to be opened asynchronously!
[LOG] SystemI::createSound                     :     setdata soundi = 0x7fc35d9f0c48 : node = 0x7fc33128bb70
[LOG] SystemI::createSound                     :     add node to async list : head = 0x7fc35119f6f8.  list count = 2
[LOG] AsyncThread::threadFunc                  : Finished Asynchronous operation on sound 0x7fc3512d8908
[LOG] AsyncThread::threadFunc                  : Starting Asynchronous operation on sound 0x7fc3511cfd48
[LOG] SystemI::createSoundInternal             :     Create name='Build/Desktop/Master.bank', mode=0x02010082
[LOG] SystemI::createSoundInternal             :     exinfo->cbsize             = 224
[LOG] SystemI::createSoundInternal             :     exinfo->length             = 3901056
[LOG] SystemI::createSoundInternal             :     exinfo->fileoffset         = 22432
[LOG] SystemI::createSoundInternal             :     exinfo->numsubsounds       = 1
[LOG] SystemI::createSoundInternal             :     exinfo->inclusionlist      = 0x7fc35d9e9760
[LOG] SystemI::createSoundInternal             :     exinfo->inclusionlistnum   = 1
[LOG] SystemI::createSoundInternal             :     exinfo->suggestedsoundtype = 5
[LOG] SystemI::createSoundInternal             :     exinfo->initialseekpostype = 1
[LOG] SystemI::createSoundInternal             :     Stream 0/1: name='OBJ-fire-torch-loop', format=5, channels=1, frequency=48000, lengthbytes=130048, lengthpcm=584456, pcmblocksize=0, loopstart=0, loopend=0, mode=0x00000000, channelmask=0x00000000, channelorder=0, peakvolume=0.639771.
[LOG] AsyncThread::threadFunc                  : Finished Asynchronous operation on sound 0x7fc3511cfd48
[LOG] AsyncThread::threadFunc                  : Starting Asynchronous operation on sound 0x7fc35d98f988
[LOG] SystemI::createSoundInternal             :     Create name='Build/Desktop/Master.bank', mode=0x02010082
[LOG] SystemI::createSoundInternal             :     exinfo->cbsize             = 224
[LOG] SystemI::createSoundInternal             :     exinfo->length             = 3901056
[LOG] SystemI::createSoundInternal             :     exinfo->fileoffset         = 22432
[LOG] SystemI::createSoundInternal             :     exinfo->numsubsounds       = 1
[LOG] SystemI::createSoundInternal             :     exinfo->inclusionlist      = 0x7fc3312d4fb0
[LOG] SystemI::createSoundInternal             :     exinfo->inclusionlistnum   = 1
[LOG] SystemI::createSoundInternal             :     exinfo->suggestedsoundtype = 5
[LOG] SystemI::createSoundInternal             :     exinfo->initialseekpostype = 1
[LOG] SystemI::createSoundInternal             :     Stream 0/1: name='OBJ-fire-torch-loop', format=5, channels=1, frequency=48000, lengthbytes=130048, lengthpcm=584456, pcmblocksize=0, loopstart=0, loopend=0, mode=0x00000000, channelmask=0x00000000, channelorder=0, peakvolume=0.639771.
[LOG] AsyncThread::threadFunc                  : Finished Asynchronous operation on sound 0x7fc35d98f988
[LOG] AsyncThread::threadFunc                  : Starting Asynchronous operation on sound 0x7fc35d9f0c48
[LOG] SystemI::createSoundInternal             :     Create name='Build/Desktop/Master.bank', mode=0x02010082
[LOG] SystemI::createSoundInternal             :     exinfo->cbsize             = 224
[LOG] SystemI::createSoundInternal             :     exinfo->length             = 3901056
[LOG] SystemI::createSoundInternal             :     exinfo->fileoffset         = 22432
[LOG] SystemI::createSoundInternal             :     exinfo->numsubsounds       = 1
[LOG] SystemI::createSoundInternal             :     exinfo->inclusionlist      = 0x7fc33128bc80
[LOG] SystemI::createSoundInternal             :     exinfo->inclusionlistnum   = 1
[LOG] SystemI::createSoundInternal             :     exinfo->suggestedsoundtype = 5
[LOG] SystemI::createSoundInternal             :     exinfo->initialseekpostype = 1
[LOG] SystemI::createSoundInternal             :     Stream 0/1: name='OBJ-fire-torch-loop', format=5, channels=1, frequency=48000, lengthbytes=130048, lengthpcm=584456, pcmblocksize=0, loopstart=0, loopend=0, mode=0x00000000, channelmask=0x00000000, channelorder=0, peakvolume=0.639771.
[LOG] AsyncThread::threadFunc                  : Finished Asynchronous operation on sound 0x7fc35d9f0c48
[LOG] SoundI::release                          : OBJ-fire-torch-loop (0x7fc351291e68)
[LOG] SoundI::release                          :     OBJ-fire-torch-loop (0x7fc33188e438)
[LOG] SoundI::release                          :     OBJ-fire-torch-loop (0x7fc3510ec598)
[LOG] SoundI::release                          : OBJ-fire-torch-loop (0x7fc331d99408)
[LOG] SoundI::release                          :     OBJ-fire-torch-loop (0x7fc35ec0bfb8)
[LOG] SoundI::release                          :     OBJ-fire-torch-loop (0x7fc332a772c8)
[LOG] SoundI::release                          : OBJ-fire-torch-loop (0x7fc35d972938)
[LOG] SoundI::release                          :     OBJ-fire-torch-loop (0x7fc33186af48)
[LOG] SoundI::release                          :     OBJ-fire-torch-loop (0x7fc33186b0d8)
[LOG] SoundI::release                          : OBJ-fire-torch-loop (0x7fc35d955fc8)
[LOG] SoundI::release                          :     OBJ-fire-torch-loop (0x7fc351183a98)
[LOG] SoundI::release                          :     OBJ-fire-torch-loop (0x7fc3511d1e58)
[LOG] AsyncThread::threadFunc                  : Starting Asynchronous operation on sound 0x7fc3507b7298
[LOG] AsyncThread::threadFunc                  : Finished Asynchronous operation on sound 0x7fc3507b7298
[LOG] AsyncThread::threadFunc                  : Starting Asynchronous operation on sound 0x7fc333416898
[LOG] AsyncThread::threadFunc                  : Finished Asynchronous operation on sound 0x7fc333416898
[LOG] AsyncThread::threadFunc                  : Starting Asynchronous operation on sound 0x7fc332aa51b8
[LOG] AsyncThread::threadFunc                  : Finished Asynchronous operation on sound 0x7fc332aa51b8
[LOG] AsyncThread::threadFunc                  : Starting Asynchronous operation on sound 0x7fc3507b7298
[LOG] AsyncThread::threadFunc                  : Finished Asynchronous operation on sound 0x7fc3507b7298
[LOG] AsyncThread::threadFunc                  : Starting Asynchronous operation on sound 0x7fc333416898
[LOG] AsyncThread::threadFunc                  : Finished Asynchronous operation on sound 0x7fc333416898
[LOG] SystemI::createSound                     : filename = Build/Desktop/Master.bank : mode 02010082
[LOG] SystemI::createSound                     : FMOD_NONBLOCKING specified.  Putting into queue to be opened asynchronously!
[LOG] SystemI::createSound                     : setdata soundi = 0x7fc3511b83a8 : node = 0x7fc3511c94c0
[LOG] SystemI::createSound                     : add node to async list : head = 0x7fc35119f6f8.  list count = 0
[LOG] AsyncThread::threadFunc                  : Starting Asynchronous operation on sound 0x7fc3511b83a8
[LOG] SystemI::createSoundInternal             :     Create name='Build/Desktop/Master.bank', mode=0x02010082
[LOG] SystemI::createSoundInternal             :     exinfo->cbsize             = 224
[LOG] SystemI::createSoundInternal             :     exinfo->length             = 3901056
[LOG] SystemI::createSoundInternal             :     exinfo->fileoffset         = 22432
[LOG] SystemI::createSoundInternal             :     exinfo->numsubsounds       = 1
[LOG] SystemI::createSoundInternal             :     exinfo->inclusionlist      = 0x7fc3511c95d0
[LOG] SystemI::createSoundInternal             :     exinfo->inclusionlistnum   = 1
[LOG] SystemI::createSoundInternal             :     exinfo->suggestedsoundtype = 5
[LOG] SystemI::createSoundInternal             :     exinfo->initialseekpostype = 1
[LOG] SystemI::createSound                     : filename = Build/Desktop/Master.bank : mode 02010082
[LOG] SystemI::createSound                     :     FMOD_NONBLOCKING specified.  Putting into queue to be opened asynchronously!
[LOG] SystemI::createSound                     :     setdata soundi = 0x7fc35d99fa18 : node = 0x7fc3511f8cc0
[LOG] SystemI::createSound                     :     add node to async list : head = 0x7fc35119f6f8.  list count = 0
[LOG] SystemI::createSoundInternal             :     Stream 0/1: name='OBJ-fire-torch-loop', format=5, channels=1, frequency=48000, lengthbytes=130048, lengthpcm=584456, pcmblocksize=0, loopstart=0, loopend=0, mode=0x00000000, channelmask=0x00000000, channelorder=0, peakvolume=0.639771.
[LOG] SystemI::createSound                     :     filename = Build/Desktop/Master.bank : mode 02010082
[LOG] SystemI::createSound                     :     FMOD_NONBLOCKING specified.  Putting into queue to be opened asynchronously!
[LOG] SystemI::createSound                     :     setdata soundi = 0x7fc35d9ea7f8 : node = 0x7fc3511c3d90
[LOG] SystemI::createSound                     :     add node to async list : head = 0x7fc35119f6f8.  list count = 1
[LOG] SystemI::createSound                     :     filename = Build/Desktop/Master.bank : mode 02010082
[LOG] SystemI::createSound                     :     FMOD_NONBLOCKING specified.  Putting into queue to be opened asynchronously!
[LOG] SystemI::createSound                     :     setdata soundi = 0x7fc3316eb7d8 : node = 0x7fc3511c3ed0
[LOG] SystemI::createSound                     :     add node to async list : head = 0x7fc35119f6f8.  list count = 2
[LOG] AsyncThread::threadFunc                  : Finished Asynchronous operation on sound 0x7fc3511b83a8
[LOG] AsyncThread::threadFunc                  : Starting Asynchronous operation on sound 0x7fc35d99fa18
[LOG] SystemI::createSoundInternal             :     Create name='Build/Desktop/Master.bank', mode=0x02010082
[LOG] SystemI::createSoundInternal             :     exinfo->cbsize             = 224
[LOG] SystemI::createSoundInternal             :     exinfo->length             = 3901056
[LOG] SystemI::createSoundInternal             :     exinfo->fileoffset         = 22432
[LOG] SystemI::createSoundInternal             :     exinfo->numsubsounds       = 1
[LOG] SystemI::createSoundInternal             :     exinfo->inclusionlist      = 0x7fc3511f8dd0
[LOG] SystemI::createSoundInternal             :     exinfo->inclusionlistnum   = 1
[LOG] SystemI::createSoundInternal             :     exinfo->suggestedsoundtype = 5
[LOG] SystemI::createSoundInternal             :     exinfo->initialseekpostype = 1
[LOG] SystemI::createSoundInternal             :     Stream 0/1: name='OBJ-fire-torch-loop', format=5, channels=1, frequency=48000, lengthbytes=130048, lengthpcm=584456, pcmblocksize=0, loopstart=0, loopend=0, mode=0x00000000, channelmask=0x00000000, channelorder=0, peakvolume=0.639771.
[LOG] AsyncThread::threadFunc                  : Finished Asynchronous operation on sound 0x7fc35d99fa18
[LOG] AsyncThread::threadFunc                  : Starting Asynchronous operation on sound 0x7fc35d9ea7f8
[LOG] SystemI::createSoundInternal             :     Create name='Build/Desktop/Master.bank', mode=0x02010082
[LOG] SystemI::createSoundInternal             :     exinfo->cbsize             = 224
[LOG] SystemI::createSoundInternal             :     exinfo->length             = 3901056
[LOG] SystemI::createSoundInternal             :     exinfo->fileoffset         = 22432
[LOG] SystemI::createSoundInternal             :     exinfo->numsubsounds       = 1
[LOG] SystemI::createSoundInternal             :     exinfo->inclusionlist      = 0x7fc3511c3ea0
[LOG] SystemI::createSoundInternal             :     exinfo->inclusionlistnum   = 1
[LOG] SystemI::createSoundInternal             :     exinfo->suggestedsoundtype = 5
[LOG] SystemI::createSoundInternal             :     exinfo->initialseekpostype = 1
[LOG] SystemI::createSoundInternal             :     Stream 0/1: name='OBJ-fire-torch-loop', format=5, channels=1, frequency=48000, lengthbytes=130048, lengthpcm=584456, pcmblocksize=0, loopstart=0, loopend=0, mode=0x00000000, channelmask=0x00000000, channelorder=0, peakvolume=0.639771.
[LOG] AsyncThread::threadFunc                  : Finished Asynchronous operation on sound 0x7fc35d9ea7f8
[LOG] AsyncThread::threadFunc                  : Starting Asynchronous operation on sound 0x7fc3316eb7d8
[LOG] SystemI::createSoundInternal             :     Create name='Build/Desktop/Master.bank', mode=0x02010082
[LOG] SystemI::createSoundInternal             :     exinfo->cbsize             = 224
[LOG] SystemI::createSoundInternal             :     exinfo->length             = 3901056
[LOG] SystemI::createSoundInternal             :     exinfo->fileoffset         = 22432
[LOG] SystemI::createSoundInternal             :     exinfo->numsubsounds       = 1
[LOG] SystemI::createSoundInternal             :     exinfo->inclusionlist      = 0x7fc3511c3fe0
[LOG] SystemI::createSoundInternal             :     exinfo->inclusionlistnum   = 1
[LOG] SystemI::createSoundInternal             :     exinfo->suggestedsoundtype = 5
[LOG] SystemI::createSoundInternal             :     exinfo->initialseekpostype = 1
[LOG] SystemI::createSoundInternal             :     Stream 0/1: name='OBJ-fire-torch-loop', format=5, channels=1, frequency=48000, lengthbytes=130048, lengthpcm=584456, pcmblocksize=0, loopstart=0, loopend=0, mode=0x00000000, channelmask=0x00000000, channelorder=0, peakvolume=0.639771.
[LOG] AsyncThread::threadFunc                  : Finished Asynchronous operation on sound 0x7fc3316eb7d8
[LOG] SoundI::release                          : OBJ-fire-torch-loop (0x7fc3512d8908)
[LOG] SoundI::release                          :     OBJ-fire-torch-loop (0x7fc3318fe338)
[LOG] SoundI::release                          :     OBJ-fire-torch-loop (0x7fc3318948b8)
[LOG] SoundI::release                          : OBJ-fire-torch-loop (0x7fc3511cfd48)
[LOG] SoundI::release                          :     OBJ-fire-torch-loop (0x7fc33189b5f8)
[LOG] SoundI::release                          :     OBJ-fire-torch-loop (0x7fc3318932a8)
[LOG] SoundI::release                          : OBJ-fire-torch-loop (0x7fc35d9f0c48)
[LOG] SoundI::release                          :     OBJ-fire-torch-loop (0x7fc3507bc788)
[LOG] SoundI::release                          :     OBJ-fire-torch-loop (0x7fc3507b7298)
[LOG] SoundI::release                          : OBJ-fire-torch-loop (0x7fc35d98f988)
[LOG] SoundI::release                          :     OBJ-fire-torch-loop (0x7fc333416708)
[LOG] SoundI::release                          :     OBJ-fire-torch-loop (0x7fc333416898)
[LOG] SystemI::createSound                     : filename = Build/Desktop/Master.bank : mode 02010082
[LOG] SystemI::createSound                     : FMOD_NONBLOCKING specified.  Putting into queue to be opened asynchronously!
[LOG] SystemI::createSound                     : setdata soundi = 0x7fc35ec0bfb8 : node = 0x7fc33188e4a0
[LOG] SystemI::createSound                     : add node to async list : head = 0x7fc35119f6f8.  list count = 0
[LOG] AsyncThread::threadFunc                  : Starting Asynchronous operation on sound 0x7fc35ec0bfb8
[LOG] SystemI::createSoundInternal             :     Create name='Build/Desktop/Master.bank', mode=0x02010082
[LOG] SystemI::createSoundInternal             :     exinfo->cbsize             = 224
[LOG] SystemI::createSoundInternal             :     exinfo->length             = 3901056
[LOG] SystemI::createSoundInternal             :     exinfo->fileoffset         = 22432
[LOG] SystemI::createSoundInternal             :     exinfo->numsubsounds       = 1
[LOG] SystemI::createSoundInternal             :     exinfo->inclusionlist      = 0x7fc33188e5b0
[LOG] SystemI::createSoundInternal             :     exinfo->inclusionlistnum   = 1
[LOG] SystemI::createSoundInternal             :     exinfo->suggestedsoundtype = 5
[LOG] SystemI::createSoundInternal             :     exinfo->initialseekpostype = 1
[LOG] SystemI::createSound                     : filename = Build/Desktop/Master.bank : mode 02010082
[LOG] SystemI::createSound                     :     FMOD_NONBLOCKING specified.  Putting into queue to be opened asynchronously!
[LOG] SystemI::createSound                     :     setdata soundi = 0x7fc332a56e88 : node = 0x7fc33188af70
[LOG] SystemI::createSound                     :     add node to async list : head = 0x7fc35119f6f8.  list count = 0
[LOG] SystemI::createSound                     :     filename = Build/Desktop/Master.bank : mode 02010082
[LOG] SystemI::createSound                     :     FMOD_NONBLOCKING specified.  Putting into queue to be opened asynchronously!
[LOG] SystemI::createSound                     :     setdata soundi = 0x7fc33188a5f8 : node = 0x7fc331897280
[LOG] SystemI::createSound                     :     add node to async list : head = 0x7fc35119f6f8.  list count = 1
[LOG] SystemI::createSoundInternal             :     Stream 0/1: name='OBJ-fire-torch-loop', format=5, channels=1, frequency=48000, lengthbytes=130048, lengthpcm=584456, pcmblocksize=0, loopstart=0, loopend=0, mode=0x00000000, channelmask=0x00000000, channelorder=0, peakvolume=0.639771.
[LOG] SystemI::createSound                     :     filename = Build/Desktop/Master.bank : mode 02010082
[LOG] SystemI::createSound                     :     FMOD_NONBLOCKING specified.  Putting into queue to be opened asynchronously!
[LOG] SystemI::createSound                     :     setdata soundi = 0x7fc33186bfb8 : node = 0x7fc3318973c0
[LOG] SystemI::createSound                     :     add node to async list : head = 0x7fc35119f6f8.  list count = 2
[LOG] AsyncThread::threadFunc                  : Finished Asynchronous operation on sound 0x7fc35ec0bfb8
[LOG] AsyncThread::threadFunc                  : Starting Asynchronous operation on sound 0x7fc332a56e88
[LOG] SystemI::createSoundInternal             :     Create name='Build/Desktop/Master.bank', mode=0x02010082
[LOG] SystemI::createSoundInternal             :     exinfo->cbsize             = 224
[LOG] SystemI::createSoundInternal             :     exinfo->length             = 3901056
[LOG] SystemI::createSoundInternal             :     exinfo->fileoffset         = 22432
[LOG] SystemI::createSoundInternal             :     exinfo->numsubsounds       = 1
[LOG] SystemI::createSoundInternal             :     exinfo->inclusionlist      = 0x7fc33188b080
[LOG] SystemI::createSoundInternal             :     exinfo->inclusionlistnum   = 1
[LOG] SystemI::createSoundInternal             :     exinfo->suggestedsoundtype = 5
[LOG] SystemI::createSoundInternal             :     exinfo->initialseekpostype = 1
[LOG] SystemI::createSoundInternal             :     Stream 0/1: name='OBJ-fire-torch-loop', format=5, channels=1, frequency=48000, lengthbytes=130048, lengthpcm=584456, pcmblocksize=0, loopstart=0, loopend=0, mode=0x00000000, channelmask=0x00000000, channelorder=0, peakvolume=0.639771.
[LOG] AsyncThread::threadFunc                  : Finished Asynchronous operation on sound 0x7fc332a56e88
[LOG] AsyncThread::threadFunc                  : Starting Asynchronous operation on sound 0x7fc33188a5f8
[LOG] SystemI::createSoundInternal             :     Create name='Build/Desktop/Master.bank', mode=0x02010082
[LOG] SystemI::createSoundInternal             :     exinfo->cbsize             = 224
[LOG] SystemI::createSoundInternal             :     exinfo->length             = 3901056
[LOG] SystemI::createSoundInternal             :     exinfo->fileoffset         = 22432
[LOG] SystemI::createSoundInternal             :     exinfo->numsubsounds       = 1
[LOG] SystemI::createSoundInternal             :     exinfo->inclusionlist      = 0x7fc331897390
[LOG] SystemI::createSoundInternal             :     exinfo->inclusionlistnum   = 1
[LOG] SystemI::createSoundInternal             :     exinfo->suggestedsoundtype = 5
[LOG] SystemI::createSoundInternal             :     exinfo->initialseekpostype = 1
[LOG] SystemI::createSoundInternal             :     Stream 0/1: name='OBJ-fire-torch-loop', format=5, channels=1, frequency=48000, lengthbytes=130048, lengthpcm=584456, pcmblocksize=0, loopstart=0, loopend=0, mode=0x00000000, channelmask=0x00000000, channelorder=0, peakvolume=0.639771.
[LOG] AsyncThread::threadFunc                  : Finished Asynchronous operation on sound 0x7fc33188a5f8
[LOG] AsyncThread::threadFunc                  : Starting Asynchronous operation on sound 0x7fc33186bfb8
[LOG] SystemI::createSoundInternal             :     Create name='Build/Desktop/Master.bank', mode=0x02010082
[LOG] SystemI::createSoundInternal             :     exinfo->cbsize             = 224
[LOG] SystemI::createSoundInternal             :     exinfo->length             = 3901056
[LOG] SystemI::createSoundInternal             :     exinfo->fileoffset         = 22432
[LOG] SystemI::createSoundInternal             :     exinfo->numsubsounds       = 1
[LOG] SystemI::createSoundInternal             :     exinfo->inclusionlist      = 0x7fc3318974d0
[LOG] SystemI::createSoundInternal             :     exinfo->inclusionlistnum   = 1
[LOG] SystemI::createSoundInternal             :     exinfo->suggestedsoundtype = 5
[LOG] SystemI::createSoundInternal             :     exinfo->initialseekpostype = 1
[LOG] SystemI::createSoundInternal             :     Stream 0/1: name='OBJ-fire-torch-loop', format=5, channels=1, frequency=48000, lengthbytes=130048, lengthpcm=584456, pcmblocksize=0, loopstart=0, loopend=0, mode=0x00000000, channelmask=0x00000000, channelorder=0, peakvolume=0.639771.
[LOG] AsyncThread::threadFunc                  : Finished Asynchronous operation on sound 0x7fc33186bfb8
[LOG] SoundI::release                          : OBJ-fire-torch-loop (0x7fc3511b83a8)
[LOG] SoundI::release                          :     OBJ-fire-torch-loop (0x7fc3419b0948)
[LOG] SoundI::release                          :     OBJ-fire-torch-loop (0x7fc3419b0ad8)
[LOG] SoundI::release                          : OBJ-fire-torch-loop (0x7fc35d99fa18)
[LOG] SoundI::release                          :     OBJ-fire-torch-loop (0x7fc3419c5ef8)
[LOG] SoundI::release                          :     OBJ-fire-torch-loop (0x7fc3419fa878)
[LOG] SoundI::release                          : OBJ-fire-torch-loop (0x7fc3316eb7d8)
[LOG] SoundI::release                          :     OBJ-fire-torch-loop (0x7fc35118da88)
[LOG] SoundI::release                          :     OBJ-fire-torch-loop (0x7fc35118dc18)
[LOG] SoundI::release                          : OBJ-fire-torch-loop (0x7fc35d9ea7f8)
[LOG] SoundI::release                          :     OBJ-fire-torch-loop (0x7fc34195fdd8)
[LOG] SoundI::release                          :     OBJ-fire-torch-loop (0x7fc34195ff68)
[LOG] AsyncThread::threadFunc                  : Starting Asynchronous operation on sound 0x7fc331da4bd8
[LOG] AsyncThread::threadFunc                  : Finished Asynchronous operation on sound 0x7fc331da4bd8
[LOG] AsyncThread::threadFunc                  : Starting Asynchronous operation on sound 0x7fc331da4698
[LOG] AsyncThread::threadFunc                  : Finished Asynchronous operation on sound 0x7fc331da4698
[LOG] SoundI::release                          :  (0x7fc331211828)
[LOG] SoundI::release                          :     amb_dog_distant_01 (0x7fc351186c58)
[LOG] SoundI::release                          :  (0x7fc332abf2e8)
[LOG] SoundI::release                          :     amb_dog_distant_02 (0x7fc331804598)
[LOG] SoundI::release                          :  (0x7fc332a45318)
[LOG] SoundI::release                          :     amb_dog_distant_03 (0x7fc332ac8a38)
[LOG] SoundI::release                          :  (0x7fc351188bc8)
[LOG] SoundI::release                          :     amb_dog_distant_04 (0x7fc331244d78)
[LOG] SoundI::release                          :  (0x7fc35d9c68e8)
[LOG] SoundI::release                          :     amb_chicken_01 (0x7fc35d9d7b38)
[LOG] SoundI::release                          :  (0x7fc35113c158)
[LOG] SoundI::release                          :     amb_chicken_02 (0x7fc3511cdbd8)
[LOG] SoundI::release                          :  (0x7fc332a878f8)
[LOG] SoundI::release                          :     amb_chicken_03 (0x7fc332af5748)
[LOG] SoundI::release                          : OBJ-fire-torch-loop (0x7fc33188a5f8)
[LOG] SoundI::release                          :     OBJ-fire-torch-loop (0x7fc331da4508)
[LOG] SoundI::release                          :     OBJ-fire-torch-loop (0x7fc331da4698)
[LOG] SoundI::release                          : OBJ-fire-torch-loop (0x7fc35ec0bfb8)
[LOG] SoundI::release                          :     OBJ-fire-torch-loop (0x7fc331da3328)
[LOG] SoundI::release                          :     OBJ-fire-torch-loop (0x7fc331da34b8)
[LOG] SoundI::release                          : OBJ-fire-torch-loop (0x7fc33186bfb8)
[LOG] SoundI::release                          :     OBJ-fire-torch-loop (0x7fc331da4a48)
[LOG] SoundI::release                          :     OBJ-fire-torch-loop (0x7fc331da4bd8)
[LOG] SoundI::release                          : OBJ-fire-torch-loop (0x7fc332a56e88)
[LOG] SoundI::release                          :     OBJ-fire-torch-loop (0x7fc331da3c18)
[LOG] SoundI::release                          :     OBJ-fire-torch-loop (0x7fc331da3da8)
[LOG] SoundI::release                          : Ambience, Grassland, Countryside, Crickets, Wind, Night 01 SND7941 (0x7fc35edb3888)
[LOG] SoundI::release                          :     Ambience, Grassland, Countryside, Crickets, Wind, Night 01 SND7941 (0x7fc332ac0c38)
[LOG] SoundI::release                          :     Ambience, Grassland, Countryside, Crickets, Wind, Night 01 SND7941 (0x7fc33187a298)
[LOG] SoundI::release                          : Ambience, Birdsong, Meadow, Day, Birds, Insects, Calm, Wyoming 01 SND40674 1 (0x7fc35d95a9b8)
[LOG] SoundI::release                          :     Ambience, Birdsong, Meadow, Day, Birds, Insects, Calm, Wyoming 01 SND40674 1 (0x7fc331882568)
[LOG] SoundI::release                          :     Ambience, Birdsong, Meadow, Day, Birds, Insects, Calm, Wyoming 01 SND40674 1 (0x7fc332aa51b8)
[LOG] SoundI::release                          :  (0x7fc3510cfec8)
[LOG] SoundI::release                          :     amb_chicken_04 (0x7fc33189ccd8)
[LOG] SoundI::release                          :  (0x7fc332a47cf8)
[LOG] SoundI::release                          :     Birds, Songbird, Pigeon, Distant 01 SND1473 (0x7fc332a8bbd8)
[LOG] SoundI::release                          :  (0x7fc35d9f7e68)
[LOG] SoundI::release                          :     Birds, Songbird, Pigeon, Distant 01 SND1473 1 (0x7fc35d912c78)
[LOG] SoundI::release                          :  (0x7fc35119dd58)
[LOG] SoundI::release                          :     Birds, Songbird, Pigeon, Distant 01 SND1473 2 (0x7fc35119eb58)
[LOG] SoundI::release                          :  (0x7fc35d95fa08)
[LOG] SoundI::release                          :     Birds, Songbird, Pigeon, Distant 01 SND1473 3 (0x7fc3312592c8)
[LOG] SoundI::release                          :  (0x7fc3511c5f18)
[LOG] SoundI::release                          :     Birds, Songbird, Pigeon, Distant 01 SND1473 4 (0x7fc35ed14ba8)
[LOG] SoundI::release                          :  (0x7fc35d90e118)
[LOG] SoundI::release                          :     Birds, Songbird, Pigeon, Distant 01 SND1473 5 (0x7fc33121f2d8)
[LOG] Thread::callback                         : FMOD Studio update thread finished.
[LOG] Thread::callback                         : FMOD Studio bank load thread finished.
[LOG] Profile::disconnectAll                   : Profiler disconnecting all clients
[LOG] Thread::callback                         : FMOD Studio sample load thread finished.
[LOG] LiveUpdate::release                      : 
[LOG] LiveUpdate::reset                        : Reset connection (reason Disconnected)
[LOG] Thread::callback                         : FMOD stream thread finished.
[LOG] Thread::callback                         : FMOD mixer thread finished.
[LOG] Profile::disconnectAll                   : Profiler disconnecting all clients
[LOG] SystemI::close                           : Closed.
[LOG] Manager::readBank                        : fileversion = 135, compatVersion = 132 (oldest = 44, newest = 135)
[LOG] Manager::readBank                        : fileversion = 135, compatVersion = 132 (oldest = 44, newest = 135)
[LOG] Manager::readBank                        : fileversion = 135, compatVersion = 132 (oldest = 44, newest = 135)
[LOG] Manager::readBank                        : fileversion = 135, compatVersion = 132 (oldest = 44, newest = 135)
[LOG] Manager::readBank                        : fileversion = 135, compatVersion = 132 (oldest = 44, newest = 135)
[LOG] Manager::readBank                        : fileversion = 135, compatVersion = 132 (oldest = 44, newest = 135)
[LOG] PlaybackSystem::acquireMasterBus         : Setting master channel group format to 3
