{
  "_class": "shapePath",
  "booleanOperation": -1,
  "do_objectID": "89D9E1CE-8718-4843-A6E9-95183C530B0F",
  "edited": true,
  "exportOptions": {
    "_class": "exportOptions",
    "exportFormats": [
    ],
    "includedLayerIds": [
    ],
    "layerOptions": 0,
    "shouldTrim": false
  },
  "frame": {
    "_class": "rect",
    "constrainProportions": false,
    "height": 2.641137578136941,
    "width": 2.922000000000001,
    "x": 6.218999999999999,
    "y": 11.45286242186306
  },
  "isFlippedHorizontal": false,
  "isFlippedVertical": false,
  "isLocked": false,
  "isVisible": true,
  "layerListExpandedType": 0,
  "name": "Path",
  "nameIsFixed": false,
  "path": {
    "_class": "path",
    "isClosed": true,
    "pointRadiusBehaviour": 1,
    "points": [
      {
        "_class": "curvePoint",
        "cornerRadius": 0,
        "curveFrom": "{3.0396249818621665e-16, 0.57101818194597143}",
        "curveMode": 4,
        "curveTo": "{3.0396249818621665e-16, 0.49983673287787106}",
        "hasCurveFrom": true,
        "hasCurveTo": false,
        "point": "{3.0396249818621665e-16, 0.49983673287787106}"
      },
      {
        "_class": "curvePoint",
        "cornerRadius": 0,
        "curveFrom": "{0.059890485968515247, 0.75919467230153392}",
        "curveMode": 2,
        "curveTo": "{0.011978097193703293, 0.6368988848068724}",
        "hasCurveFrom": true,
        "hasCurveTo": true,
        "point": "{0.035934291581109272, 0.69823609091874617}"
      },
      {
        "_class": "curvePoint",
        "cornerRadius": 0,
        "curveFrom": "{0.18343600273785121, 0.90080032097956309}",
        "curveMode": 2,
        "curveTo": "{0.094113620807666387, 0.81182350964443817}",
        "hasCurveFrom": true,
        "hasCurveTo": true,
        "point": "{0.13894592744695461, 0.85650122767654302}"
      },
      {
        "_class": "curvePoint",
        "cornerRadius": 0,
        "curveFrom": "{0.35728952772073963, 0.98712675921108806}",
        "curveMode": 2,
        "curveTo": "{0.23613963039014413, 0.93601242078452751}",
        "hasCurveFrom": true,
        "hasCurveTo": true,
        "point": "{0.2963723477070504, 0.96138027763326472}"
      },
      {
        "_class": "curvePoint",
        "cornerRadius": 0,
        "curveFrom": "{0.57460643394935007, 1}",
        "curveMode": 2,
        "curveTo": "{0.42505133470225925, 1}",
        "hasCurveFrom": true,
        "hasCurveTo": true,
        "point": "{0.50000000000000033, 1}"
      },
      {
        "_class": "curvePoint",
        "cornerRadius": 0,
        "curveFrom": "{0.76386036960985648, 0.93563379605544139}",
        "curveMode": 2,
        "curveTo": "{0.64236824093086942, 0.98712675921108806}",
        "hasCurveFrom": true,
        "hasCurveTo": true,
        "point": "{0.70294318959616697, 0.96138027763326472}"
      },
      {
        "_class": "curvePoint",
        "cornerRadius": 0,
        "curveFrom": "{0.90499907410802916, 0.81261750241354958}",
        "curveMode": 2,
        "curveTo": "{0.8162217659137575, 0.90080032097956242}",
        "hasCurveFrom": true,
        "hasCurveTo": true,
        "point": "{0.86071184120465438, 0.85650122767654302}"
      },
      {
        "_class": "curvePoint",
        "cornerRadius": 0,
        "curveFrom": "{0.98767967145790569, 0.6368988848068724}",
        "curveMode": 2,
        "curveTo": "{0.94014588624624162, 0.75861860235823053}",
        "hasCurveFrom": true,
        "hasCurveTo": true,
        "point": "{0.96372347707049966, 0.69823609091874617}"
      },
      {
        "_class": "curvePoint",
        "cornerRadius": 0,
        "curveFrom": "{1, 0.42903390853885681}",
        "curveMode": 2,
        "curveTo": "{1, 0.57101818194597143}",
        "hasCurveFrom": true,
        "hasCurveTo": true,
        "point": "{1, 0.49983673287787106}"
      },
      {
        "_class": "curvePoint",
        "cornerRadius": 0,
        "curveFrom": "{0.94024566915179808, 0.24146899165278507}",
        "curveMode": 2,
        "curveTo": "{0.98767967145790569, 0.36277458094886972}",
        "hasCurveFrom": true,
        "hasCurveTo": true,
        "point": "{0.96372347707049966, 0.30181599956608202}"
      },
      {
        "_class": "curvePoint",
        "cornerRadius": 0,
        "curveFrom": "{0.81468177838442479, 0.098051207786081174}",
        "curveMode": 2,
        "curveTo": "{0.90521749510919447, 0.18747297617685793}",
        "hasCurveFrom": true,
        "hasCurveTo": true,
        "point": "{0.86105407255304567, 0.14355086280828525}"
      },
      {
        "_class": "curvePoint",
        "cornerRadius": 0,
        "curveFrom": "{0.63800481266706932, 0.012154092488412054}",
        "curveMode": 2,
        "curveTo": "{0.76106701544223998, 0.062487144795143681}",
        "hasCurveFrom": true,
        "hasCurveTo": true,
        "point": "{0.70294318959616697, 0.038671812851564208}"
      },
      {
        "_class": "curvePoint",
        "cornerRadius": 0,
        "curveFrom": "{0.4247091033538673, 5.2090484828921928e-05}",
        "curveMode": 4,
        "curveTo": "{0.56921487968368034, -0.00093650749048445313}",
        "hasCurveFrom": true,
        "hasCurveTo": true,
        "point": "{0.5, 5.2090484828921928e-05}"
      },
      {
        "_class": "curvePoint",
        "cornerRadius": 0,
        "curveFrom": "{0.23613963039014382, 0.064039669700302088}",
        "curveMode": 2,
        "curveTo": "{0.3572895277207393, 0.012925331273740908}",
        "hasCurveFrom": true,
        "hasCurveTo": true,
        "point": "{0.29671457905544141, 0.038671812851564208}"
      },
      {
        "_class": "curvePoint",
        "cornerRadius": 0,
        "curveFrom": "{0.094782504890805891, 0.1874729761768586}",
        "curveMode": 2,
        "curveTo": "{0.18377823408624225, 0.099251769505266499}",
        "hasCurveFrom": true,
        "hasCurveTo": true,
        "point": "{0.138945927446954, 0.14355086280828591}"
      },
      {
        "_class": "curvePoint",
        "cornerRadius": 0,
        "curveFrom": "{0.011978097193702989, 0.36277458094887044}",
        "curveMode": 2,
        "curveTo": "{0.059754330848201975, 0.24146899165278574}",
        "hasCurveFrom": true,
        "hasCurveTo": true,
        "point": "{0.036276522929500288, 0.30181599956608268}"
      },
      {
        "_class": "curvePoint",
        "cornerRadius": 0,
        "curveFrom": "{0, 0.49983673287787173}",
        "curveMode": 4,
        "curveTo": "{0, 0.42903390853885748}",
        "hasCurveFrom": false,
        "hasCurveTo": true,
        "point": "{0, 0.49983673287787173}"
      }
    ]
  },
  "resizingConstraint": 63,
  "resizingType": 0,
  "rotation": 0,
  "shouldBreakMaskChain": false
}