<?xml version="1.0" encoding="UTF-8"?>
<svg width="16px" height="16px" viewBox="0 0 16 16" version="1.1" xmlns="http://www.w3.org/2000/svg" xmlns:xlink="http://www.w3.org/1999/xlink">
    <!-- Generator: Sketch 63.1 (92452) - https://sketch.com -->
    <title>icn/rss</title>
    <desc>Created with Sketch.</desc>
    <g id="icn/rss" stroke="none" stroke-width="1" fill="none" fill-rule="evenodd">
        <path d="M7.30791,2.56296 C8.72424,3.05942 10.0106,3.8683 11.0718,4.92964 C12.1329,5.99098 12.9415,7.27756 13.4377,8.69398 C13.9339,10.1104 14.1049,11.6203 13.938,13.1119 C13.8766,13.6607 13.3819,14.0559 12.833,13.9945 C12.2842,13.9331 11.889,13.4383 11.9504,12.8895 C12.0839,11.6963 11.9471,10.4883 11.5502,9.35519 C11.1532,8.22205 10.5063,7.19279 9.65742,6.34371 C8.80852,5.49464 7.77939,4.84753 6.64633,4.45037 C5.51327,4.0532 4.30535,3.91617 3.11211,4.04943 C2.56324,4.11072 2.0686,3.71546 2.0073,3.16659 C1.94601,2.61772 2.34127,2.12308 2.89014,2.06178 C4.38168,1.89521 5.89159,2.06651 7.30791,2.56296 Z M4,10 C5.10457,10 6,10.8954 6,12 C6,13.1046 5.10457,14 4,14 C2.89543,14 2,13.1046 2,12 C2,10.8954 2.89543,10 4,10 Z M5.72823,6.25428 C6.67781,6.5399 7.5418,7.05641 8.24292,7.75762 C8.94405,8.45883 9.46045,9.32288 9.74595,10.2725 C10.0315,11.2221 10.0771,12.2277 9.87895,13.1993 C9.76856,13.7404 9.24039,14.0896 8.69925,13.9792 C8.15811,13.8688 7.80891,13.3407 7.9193,12.7995 C8.05144,12.1518 8.02098,11.4814 7.83064,10.8483 C7.64031,10.2153 7.29604,9.63922 6.82862,9.17175 C6.36121,8.70427 5.78522,8.35993 5.15216,8.16952 C4.51911,7.97911 3.84874,7.94857 3.20099,8.08062 C2.65984,8.19094 2.13171,7.84168 2.02139,7.30053 C1.91107,6.75938 2.26032,6.23125 2.80148,6.12093 C3.77309,5.92285 4.77866,5.96867 5.72823,6.25428 Z" id="icon" fill="#000000"></path>
    </g>
</svg>