<svg xmlns="http://www.w3.org/2000/svg" width="2070.376" height="132.388" viewBox="0 0 2070.376 132.388">
  <path id="Path_44" data-name="Path 44" d="M7904.092,982.789s224.807-107.43,437.679-49.736,650.552,123.346,901.223,63.662,401.592-86.883,462.262-81.45,288.755,33.7,267.866,93.387-2069.03,31.831-2069.03,31.831Z" transform="translate(-7904.092 -914.587)" fill="#f7f7f7"/>
</svg>
