{
  "project_info": {
    "project_number": "591636648056",
    "firebase_url": "https://mykotlinproject-636c1.firebaseio.com",
    "project_id": "mykotlinproject-636c1",
    "storage_bucket": "mykotlinproject-636c1.appspot.com"
  },
  "client": [
    {
      "client_info": {
        "mobilesdk_app_id": "1:591636648056:android:d052666a093a85de",
        "android_client_info": {
          "package_name": "com.shankar.introtokotlinfirebase"
        }
      },
      "oauth_client": [
        {
          "client_id": "591636648056-32qfd9rlg67vfdfmh8d0fj69730nsnt1.apps.googleusercontent.com",
          "client_type": 1,
          "android_info": {
            "package_name": "com.shankar.introtokotlinfirebase",
            "certificate_hash": "d65f68f22970bfc38b9020c2bbd0ebd950fecc13"
          }
        },
        {
          "client_id": "591636648056-c806040e8ovb78kc24i2512p4qbb1aar.apps.googleusercontent.com",
          "client_type": 3
        }
      ],
      "api_key": [
        {
          "current_key": "AIzaSyCBpr8KuaWzSdf5_TL2jpvMeJty_rAkuEk"
        }
      ],
      "services": {
        "analytics_service": {
          "status": 1
        },
        "appinvite_service": {
          "status": 2,
          "other_platform_oauth_client": [
            {
              "client_id": "591636648056-c806040e8ovb78kc24i2512p4qbb1aar.apps.googleusercontent.com",
              "client_type": 3
            }
          ]
        },
        "ads_service": {
          "status": 2
        }
      }
    }
  ],
  "configuration_version": "1"
}