<?xml version="1.0" encoding="UTF-8" standalone="no"?>
<svg
   xmlns:dc="http://purl.org/dc/elements/1.1/"
   xmlns:cc="http://creativecommons.org/ns#"
   xmlns:rdf="http://www.w3.org/1999/02/22-rdf-syntax-ns#"
   xmlns:svg="http://www.w3.org/2000/svg"
   xmlns="http://www.w3.org/2000/svg"
   xmlns:sodipodi="http://sodipodi.sourceforge.net/DTD/sodipodi-0.dtd"
   xmlns:inkscape="http://www.inkscape.org/namespaces/inkscape"
   inkscape:version="1.0 (4035a4fb49, 2020-05-01)"
   sodipodi:docname="digitec.svg"
   viewBox="0 0 195 195"
   height="195"
   width="195"
   id="svg10"
   version="1.1">
  <metadata
     id="metadata16">
    <rdf:RDF>
      <cc:Work
         rdf:about="">
        <dc:format>image/svg+xml</dc:format>
        <dc:type
           rdf:resource="http://purl.org/dc/dcmitype/StillImage" />
        <dc:title></dc:title>
      </cc:Work>
    </rdf:RDF>
  </metadata>
  <defs
     id="defs14" />
  <sodipodi:namedview
     inkscape:current-layer="g18"
     inkscape:window-maximized="1"
     inkscape:window-y="-9"
     inkscape:window-x="-9"
     inkscape:cy="97.5"
     inkscape:cx="97.5"
     inkscape:zoom="4.3641026"
     showgrid="false"
     id="namedview12"
     inkscape:window-height="1051"
     inkscape:window-width="1920"
     inkscape:pageshadow="2"
     inkscape:pageopacity="0"
     guidetolerance="10"
     gridtolerance="10"
     objecttolerance="10"
     borderopacity="1"
     bordercolor="#666666"
     pagecolor="#ffffff" />
  <g
     id="g18"
     inkscape:label="Image"
     inkscape:groupmode="layer">
    <path
       id="path24"
       d="m 1.0000003,14.312573 v 54 l 18.9999997,-19 33.000002,-35 H 1.0000003 M 148,14.312573 128,80.312577 C 118.478,69.975573 109.497,62.757673 95.000002,61.387373 c -12.4811,-1.1797 -24.6374,0.016 -36,5.7346 C 29.4872,81.975177 12.3758,122.24458 25.4645,153.31258 c 13.8718,32.926 54.443802,31.076 77.5355,10 l -3.999998,13 H 144 c 1.697,-19.464 11.309,-39.527 17.33,-58 C 172.621,83.671477 183.726,48.959873 195,14.312573 H 148 M 93.000002,86.641277 c 14.367998,-2.5184 22.446998,9.6292 22.959998,22.671303 0.686,17.427 -10.133,40.538 -28.959998,43.674 -13.3882,2.231 -21.0765,-9.719 -21.9105,-21.674 -1.1978,-17.169 9.1085,-41.375603 27.9105,-44.671303 z"
       style="fill:#1b5c9e;stroke:none" />
  </g>
</svg>
