<?xml version="1.0" encoding="UTF-8" standalone="no"?>
<svg
   xmlns:dc="http://purl.org/dc/elements/1.1/"
   xmlns:cc="http://creativecommons.org/ns#"
   xmlns:rdf="http://www.w3.org/1999/02/22-rdf-syntax-ns#"
   xmlns:svg="http://www.w3.org/2000/svg"
   xmlns="http://www.w3.org/2000/svg"
   xmlns:sodipodi="http://sodipodi.sourceforge.net/DTD/sodipodi-0.dtd"
   xmlns:inkscape="http://www.inkscape.org/namespaces/inkscape"
   inkscape:version="1.0 (4035a4fb49, 2020-05-01)"
   sodipodi:docname="leo.svg"
   viewBox="0 0 160 160"
   height="160"
   width="160"
   id="svg10"
   version="1.1">
  <metadata
     id="metadata16">
    <rdf:RDF>
      <cc:Work
         rdf:about="">
        <dc:format>image/svg+xml</dc:format>
        <dc:type
           rdf:resource="http://purl.org/dc/dcmitype/StillImage" />
        <dc:title></dc:title>
      </cc:Work>
    </rdf:RDF>
  </metadata>
  <defs
     id="defs14" />
  <sodipodi:namedview
     inkscape:current-layer="g18"
     inkscape:window-maximized="1"
     inkscape:window-y="-9"
     inkscape:window-x="-9"
     inkscape:cy="76.723899"
     inkscape:cx="74.852332"
     inkscape:zoom="3.828125"
     showgrid="false"
     id="namedview12"
     inkscape:window-height="1051"
     inkscape:window-width="1920"
     inkscape:pageshadow="2"
     inkscape:pageopacity="0"
     guidetolerance="10"
     gridtolerance="10"
     objecttolerance="10"
     borderopacity="1"
     bordercolor="#666666"
     pagecolor="#ffffff" />
  <g
     id="g18"
     inkscape:label="Image"
     inkscape:groupmode="layer">
    <path
       id="path22"
       d="m 55.815287,67.025538 1,4 33.937501,-9.652 3.0625,-6.348 c -12.5458,1.62015 -27.385201,5.0067 -38.000001,12 m -44,-8 c -3.1991503,10.071 -2.6029403,30.1474 -12.00000035,36 4.98849005,9.890802 35.72160035,1.3402 44.00000035,-3 -8.1691,-8.3419 -23.8777,1.9742 -34.0000006,0 2.0191006,-8.3836 9.4910006,-26.6043 2.0000006,-33 m 118.000003,6.5293 c -9.691,2.2245 -28.52,15.6497 -21.141,27.4275 5.222,8.334502 21.486,9.220802 30.141,7.374202 3.857,-0.823002 7.584,-2.235502 10.999,-4.210602 23.67,-13.6882 -0.678,-35.0262 -19.999,-30.5911 m 14,4.1242 c 9.214,0.1737 13.615,11.775 7.772,18.2423 -6.748,7.4687 -18.199,9.5294 -27.772,9.0641 -11.724,-0.5699 -14.936,-9.0846 -6.532,-17.4923 6.233,-6.2369 17.759,-9.9794 26.532,-9.8141 m -88.000003,8.3465 c 4.3891,7.8816 26.092701,-0.34 33.000001,-3 v -2 c -8.7688,-3.8424 -24.401701,1.6888 -33.000001,5 m -5,18 c 2.973,5.390902 7.9215,3.5779 13,2.1404 11.572701,-3.2756 23.758001,-5.8992 35.000001,-10.1404 -3.1643,-6.2169 -8.3925,-3.5353 -14,-2.1265 -11.431601,2.8718 -23.181601,5.331 -34.000001,10.1265 z"
       style="fill:#f7d72e;stroke:none" />
  </g>
</svg>
