{
  "Servers": {
    "1": {
      "Name": "local",
      "Group": "Servers",
      "Port": 5432,
      "Username": "ratpud",
      "Password": "ratpud",
      "Host": "postgres",
      "SSLMode": "prefer",
      "MaintenanceDB": "postgres"
    }
  }
}
