{
  "id": "{621D17A2-143D-638C-830C-F8C2BA10040F}",
  "name": "GeraeteStatus",
  "type": 3,
  "vendor": "",
  "aliases": [ "GeraeteStatus", "GeräteStatus", "Fertigmeldung", "Waschmaschine", "Wäschetrockner", "Geschirrspüler" ],
  "url": "https://gitlab.com/sg-ips-module/public/geraetestatus/-/blob/master/README.md",
  "parentRequirements": [],
  "childRequirements": [],
  "implemented": [],
  "prefix": "GS"
}
