<?xml version="1.0" encoding="UTF-8" standalone="no"?>
<!-- Created with Inkscape (http://www.inkscape.org/) -->

<svg
   width="115.36167mm"
   height="74.68148mm"
   viewBox="0 0 115.36167 74.681477"
   version="1.1"
   id="svg1"
   xml:space="preserve"
   xmlns="http://www.w3.org/2000/svg"
   xmlns:svg="http://www.w3.org/2000/svg"><defs
     id="defs1" /><g
     id="layer1"
     transform="translate(-47.31916,-111.15926)"><g
       id="layer1-1"
       transform="translate(4.69036,75.65199)"><g
         id="g25"><rect
           style="fill:#010101;fill-opacity:1;stroke:none;stroke-width:0.499999;stroke-linecap:square;stroke-linejoin:round;stroke-miterlimit:0;paint-order:markers fill stroke"
           id="rect1-7"
           width="10.170011"
           height="16.455421"
           x="52.629803"
           y="45.765049" /><rect
           style="fill:#010101;fill-opacity:1;stroke:none;stroke-width:0.499999;stroke-linecap:square;stroke-linejoin:round;stroke-miterlimit:0;paint-order:markers fill stroke"
           id="rect2-0"
           width="10.170011"
           height="16.455421"
           x="64.799812"
           y="45.765049" /><rect
           style="fill:#010101;fill-opacity:1;stroke:none;stroke-width:0.499999;stroke-linecap:square;stroke-linejoin:round;stroke-miterlimit:0;paint-order:markers fill stroke"
           id="rect3"
           width="10.170011"
           height="16.455421"
           x="76.969826"
           y="45.765049" /><rect
           style="fill:#010101;fill-opacity:1;stroke:none;stroke-width:0.499999;stroke-linecap:square;stroke-linejoin:round;stroke-miterlimit:0;paint-order:markers fill stroke"
           id="rect4"
           width="10.170011"
           height="16.455421"
           x="89.139832"
           y="45.765049" /><rect
           style="fill:#010101;fill-opacity:1;stroke:none;stroke-width:0.499999;stroke-linecap:square;stroke-linejoin:round;stroke-miterlimit:0;paint-order:markers fill stroke"
           id="rect5"
           width="10.170011"
           height="16.455421"
           x="101.30984"
           y="45.765049" /><rect
           style="fill:#010101;fill-opacity:1;stroke:none;stroke-width:0.499999;stroke-linecap:square;stroke-linejoin:round;stroke-miterlimit:0;paint-order:markers fill stroke"
           id="rect6"
           width="10.170011"
           height="16.455421"
           x="113.47986"
           y="45.765049" /><rect
           style="fill:#010101;fill-opacity:1;stroke:none;stroke-width:0.499999;stroke-linecap:square;stroke-linejoin:round;stroke-miterlimit:0;paint-order:markers fill stroke"
           id="rect7"
           width="10.170011"
           height="16.455421"
           x="125.64986"
           y="45.765049" /><rect
           style="fill:#010101;fill-opacity:1;stroke:none;stroke-width:0.499999;stroke-linecap:square;stroke-linejoin:round;stroke-miterlimit:0;paint-order:markers fill stroke"
           id="rect8"
           width="10.170011"
           height="16.455421"
           x="137.81987"
           y="45.765049" /><rect
           style="fill:#010101;fill-opacity:1;stroke:none;stroke-width:0.499999;stroke-linecap:square;stroke-linejoin:round;stroke-miterlimit:0;paint-order:markers fill stroke"
           id="rect9"
           width="10.170011"
           height="16.455421"
           x="52.629803"
           y="64.620468" /><rect
           style="fill:#010101;fill-opacity:1;stroke:none;stroke-width:0.499999;stroke-linecap:square;stroke-linejoin:round;stroke-miterlimit:0;paint-order:markers fill stroke"
           id="rect10"
           width="10.170011"
           height="16.455421"
           x="64.799812"
           y="64.620468" /><rect
           style="fill:#010101;fill-opacity:1;stroke:none;stroke-width:0.499999;stroke-linecap:square;stroke-linejoin:round;stroke-miterlimit:0;paint-order:markers fill stroke"
           id="rect11-9"
           width="10.170011"
           height="16.455421"
           x="76.969826"
           y="64.620468" /><rect
           style="fill:#010101;fill-opacity:1;stroke:none;stroke-width:0.499999;stroke-linecap:square;stroke-linejoin:round;stroke-miterlimit:0;paint-order:markers fill stroke"
           id="rect12-3"
           width="10.170011"
           height="16.455421"
           x="89.139832"
           y="64.620468" /><rect
           style="fill:#010101;fill-opacity:1;stroke:none;stroke-width:0.499999;stroke-linecap:square;stroke-linejoin:round;stroke-miterlimit:0;paint-order:markers fill stroke"
           id="rect13"
           width="10.170011"
           height="16.455421"
           x="101.30984"
           y="64.620468" /><rect
           style="fill:#010101;fill-opacity:1;stroke:none;stroke-width:0.499999;stroke-linecap:square;stroke-linejoin:round;stroke-miterlimit:0;paint-order:markers fill stroke"
           id="rect14-6"
           width="10.170011"
           height="16.455421"
           x="113.47986"
           y="64.620468" /><rect
           style="fill:#010101;fill-opacity:1;stroke:none;stroke-width:0.499999;stroke-linecap:square;stroke-linejoin:round;stroke-miterlimit:0;paint-order:markers fill stroke"
           id="rect15"
           width="10.170011"
           height="16.455421"
           x="125.64986"
           y="64.620468" /><rect
           style="fill:#010101;fill-opacity:1;stroke:none;stroke-width:0.499999;stroke-linecap:square;stroke-linejoin:round;stroke-miterlimit:0;paint-order:markers fill stroke"
           id="rect16-0"
           width="10.170011"
           height="16.455421"
           x="137.81987"
           y="64.620468" /><rect
           style="fill:#010101;fill-opacity:1;stroke:none;stroke-width:0.499999;stroke-linecap:square;stroke-linejoin:round;stroke-miterlimit:0;paint-order:markers fill stroke"
           id="rect17"
           width="10.170011"
           height="16.455421"
           x="52.629803"
           y="83.475891" /><rect
           style="fill:#010101;fill-opacity:1;stroke:none;stroke-width:0.499999;stroke-linecap:square;stroke-linejoin:round;stroke-miterlimit:0;paint-order:markers fill stroke"
           id="rect18"
           width="10.170011"
           height="16.455421"
           x="64.799812"
           y="83.475891" /><rect
           style="fill:#010101;fill-opacity:1;stroke:none;stroke-width:0.499999;stroke-linecap:square;stroke-linejoin:round;stroke-miterlimit:0;paint-order:markers fill stroke"
           id="rect19"
           width="10.170011"
           height="16.455421"
           x="76.969826"
           y="83.475891" /><rect
           style="fill:#010101;fill-opacity:1;stroke:none;stroke-width:0.499999;stroke-linecap:square;stroke-linejoin:round;stroke-miterlimit:0;paint-order:markers fill stroke"
           id="rect20"
           width="10.170011"
           height="16.455421"
           x="89.139832"
           y="83.475891" /><rect
           style="fill:#010101;fill-opacity:1;stroke:none;stroke-width:0.499999;stroke-linecap:square;stroke-linejoin:round;stroke-miterlimit:0;paint-order:markers fill stroke"
           id="rect21"
           width="10.170011"
           height="16.455421"
           x="101.30984"
           y="83.475891" /><rect
           style="fill:#010101;fill-opacity:1;stroke:none;stroke-width:0.499999;stroke-linecap:square;stroke-linejoin:round;stroke-miterlimit:0;paint-order:markers fill stroke"
           id="rect22"
           width="10.170011"
           height="16.455421"
           x="113.47986"
           y="83.475891" /><rect
           style="fill:#010101;fill-opacity:1;stroke:none;stroke-width:0.499999;stroke-linecap:square;stroke-linejoin:round;stroke-miterlimit:0;paint-order:markers fill stroke"
           id="rect23"
           width="10.170011"
           height="16.455421"
           x="125.64986"
           y="83.475891" /><rect
           style="fill:#010101;fill-opacity:1;stroke:none;stroke-width:0.499999;stroke-linecap:square;stroke-linejoin:round;stroke-miterlimit:0;paint-order:markers fill stroke"
           id="rect24"
           width="10.170011"
           height="16.455421"
           x="137.81987"
           y="83.475891" /></g></g><path
       id="path15"
       style="display:none;fill:#ffffff;fill-opacity:1;stroke:none;stroke-width:0.641181;stroke-opacity:1"
       d="m 104.88112,69.924213 c -47.616561,0 -86.285314,38.663747 -86.285314,86.280327 0,2.44924 0.127542,4.86803 0.328104,7.26588 h -0.328104 v 3.02935 c 0,2.46051 0.521448,4.77587 0.723835,7.18448 l -0.614883,-0.0242 -0.103938,3.02935 c -1.682133,47.71473 38.662489,86.38926 86.2803,86.38926 47.62474,0 90.57729,-38.80997 86.27029,-86.55458 l -0.27428,-3.02055 -0.42578,0.0376 c 0.19459,-2.36215 0.71007,-4.62977 0.71007,-7.04172 v -3.02935 h -0.3281 c 0.20065,-2.39785 0.3281,-4.81663 0.3281,-7.26588 0,-8.92852 -1.35925,-17.5417 -3.88216,-25.64477 -0.42046,-1.35047 -0.87333,-2.68621 -1.3575,-4.0074 -12.10442,-33.029722 -43.8402,-56.628232 -81.04064,-56.628232 z m 0,6.058678 c 15.91927,0 30.73427,4.643119 43.20338,12.623261 l -35.85109,55.975708 c -2.13217,-1.35767 -4.65487,-2.14897 -7.35355,-2.14897 -7.569916,0 -13.774143,6.20297 -13.774143,13.77288 0,0.0826 0.0048,0.16431 0.0073,0.24673 l -66.456281,-0.18539 c -1.7e-5,-0.0218 -0.0013,-0.0417 -0.0013,-0.0625 0,-1.38571 0.0347,-2.76305 0.103938,-4.13138 2.145754,-42.41834 37.16507,-76.09029 80.121746,-76.09029 z m 71.73349,44.286629 c 2.53414,5.05415 4.56516,10.4045 5.99354,16.00076 l -64.33484,16.75088 c -0.18272,-0.76242 -0.42566,-1.50074 -0.73011,-2.20907 z m -71.73475,28.22203 c 4.29575,0 7.71422,3.41849 7.71422,7.71422 0,4.29576 -3.41847,7.71549 -7.71422,7.71549 -4.29576,0 -7.715464,-3.41973 -7.715464,-7.71549 0,-4.29573 3.419704,-7.71422 7.715464,-7.71422 z m 13.74033,8.61964 66.45502,0.21156 c -0.59993,43.82346 -36.22681,79.10833 -80.19409,79.10833 -15.629059,0 -30.196754,-4.47254 -42.523392,-12.18747 l 35.843578,-56.00825 c 1.981804,1.10866 4.260054,1.74446 6.678554,1.74446 7.26573,0 13.26928,-5.71587 13.74033,-12.86873 z m -26.814435,3.40379 c 0.241367,0.72601 0.541549,1.42612 0.895409,2.09386 l -59.036329,30.55005 c -2.599743,-5.00454 -4.689444,-10.31374 -6.196423,-15.868 z m 89.136815,45.87958 c -11.10834,29.49194 -42.1957,50.62582 -76.06145,50.62582 -29.739538,0 -56.066079,-16.35057 -69.913884,-40.32683 15.670423,21.76988 41.070822,36.09027 69.913884,36.09027 33.14383,0 61.61182,-18.94349 76.06145,-46.38926 z m -10.16122,5.44879 c -14.44517,21.00277 -38.45291,34.88306 -65.90023,34.88306 -27.429804,0 -51.423558,-13.86376 -65.871433,-34.84424 20.261237,23.93984 47.316646,30.60766 65.871433,30.60766 18.58042,0 45.64403,-6.68231 65.90023,-30.64648 z" /><path
       id="path3"
       style="display:none;fill:#ffffff;fill-opacity:1;stroke:none;stroke-width:0.641181;stroke-opacity:1"
       d="m 30.084857,199.22747 c 23.80828,41.23716 76.626443,55.3934 117.863613,31.58511 2.1211,-1.22462 4.15207,-2.54446 6.12838,-3.91708 l 0.16406,0.28414 2.62349,-1.51467 c 2.13086,-1.23026 3.8753,-2.83952 5.86002,-4.2191 l 0.28649,0.5446 2.67546,-1.42466 C 207.84961,198.16522 221.17042,143.88849 197.36151,102.65025 173.54914,61.406016 118.46245,43.613002 79.267905,71.215278 l -2.478733,1.747809 0.245452,0.349936 c -2.142977,1.012555 -4.364533,1.699946 -6.453343,2.905921 l -2.623494,1.514675 0.16405,0.284143 c -2.176924,1.025157 -4.335374,2.124172 -6.456487,3.348797 -7.732325,4.46426 -14.511933,9.947995 -20.267942,16.184435 -0.959312,1.039364 -1.889661,2.099431 -2.79176,3.179326 -22.552369,26.9976 -27.121388,66.28085 -8.521168,98.49737 z m 5.246969,-3.02933 C 27.372191,182.41164 23.98575,167.25992 24.662201,152.47128 l 66.40193,3.0601 c -0.109692,2.52535 0.466372,5.10572 1.815712,7.44285 3.784958,6.55574 12.258997,8.82727 18.814737,5.04231 0.0715,-0.0413 0.1399,-0.0863 0.21002,-0.12968 l 33.06759,57.64552 c -0.0189,0.0109 -0.0355,0.022 -0.0535,0.0324 -1.20006,0.69285 -2.41022,1.35147 -3.62984,1.97567 -37.80824,19.3509 -84.478664,5.85925 -105.957002,-31.34232 z m 2.486601,-84.26634 c 3.109952,-4.72171 6.727981,-9.1558 10.860294,-13.190942 l 46.674108,47.340162 c -0.568915,0.53945 -1.086849,1.11901 -1.548056,1.73683 z m 60.30837,48.0131 c -2.147875,-3.72023 -0.896611,-8.38996 2.823603,-10.53782 3.72023,-2.14788 8.39104,-0.89727 10.53892,2.82296 2.14788,3.72024 0.89616,8.39166 -2.82408,10.53954 -3.72021,2.14786 -8.39056,0.89555 -10.538443,-2.82468 z M 98.721459,143.7356 65.677165,86.078087 C 103.92936,64.685911 152.30039,77.89726 174.28403,115.97404 c 7.81453,13.53516 11.22505,28.38743 10.70704,42.92007 l -66.42636,-3.03732 c -0.0308,-2.27062 -0.61928,-4.56155 -1.82853,-6.65603 -3.63286,-6.2923 -11.58472,-8.6336 -18.014808,-5.46511 z m 16.354981,21.52009 c 0.50806,-0.57204 0.96429,-1.18206 1.36564,-1.82238 l 55.97528,35.85194 c -3.03419,4.75371 -6.58724,9.21805 -10.64388,13.30026 z M 110.24092,65.121153 c 31.09494,-5.125865 64.9411,11.229638 81.87397,40.558237 14.86977,25.7552 13.87303,56.72993 0.0329,80.71062 11.01806,-24.45593 10.71968,-53.61351 -3.70185,-78.59234 -16.57191,-28.703398 -47.21145,-43.885655 -78.205,-42.676517 z m 9.7994,6.07548 c 25.41152,2.008499 49.43607,15.859667 63.15973,39.629747 13.7149,23.7549 13.70541,51.46598 2.75972,74.46845 10.60189,-29.51667 2.84869,-56.28125 -6.4287,-72.35016 C 170.24086,96.85355 150.922,76.756931 120.04032,71.196633 Z" /><g
       id="g2"
       transform="translate(41.779093,100.81787)"
       style="stroke:#ffffff;stroke-width:2;stroke-dasharray:none;stroke-opacity:1"><path
         style="color:#000000;fill:#000000;stroke:#ffffff;stroke-width:2;stroke-linecap:square;stroke-miterlimit:3.9;stroke-dasharray:none;stroke-opacity:1"
         d="m 63.042969,26.416016 c -7.515628,0 -13.65039,6.134763 -13.650391,13.65039 v 0.002 l 0.02148,9.91211 0.0039,2 4,-0.0078 -0.0039,-2 -0.02148,-9.910156 c 0.0021,-5.352009 4.297855,-9.646484 9.650391,-9.646484 5.353869,0 9.652343,4.296522 9.652343,9.65039 v 0.0039 l 0.04297,11.882813 0.0059,2 4,-0.01367 -0.0059,-2 -0.04297,-11.880859 C 76.690991,32.546587 70.555949,26.416017 63.042969,26.416016 Z"
         id="path2"
         transform="translate(1.25e-6)" /><rect
         style="fill:#000000;stroke:#ffffff;stroke-width:2;stroke-linecap:square;stroke-miterlimit:3.9;stroke-dasharray:none;stroke-opacity:1"
         id="rect2"
         width="33.693195"
         height="26.363142"
         x="46.37431"
         y="42.585098"
         ry="3.3817849" /></g><path
       id="rect25-2"
       style="fill:none;fill-opacity:1;stroke:#000000;stroke-width:4;stroke-linecap:square;stroke-linejoin:miter;stroke-miterlimit:100;stroke-dasharray:none;stroke-opacity:1;paint-order:markers fill stroke"
       d="M 64.969161,37.507271 H 44.6288 v 70.681479 h 20.340361 m 70.681469,0 h 20.33985 V 37.507271 h -20.33985"
       transform="translate(4.69036,75.65199)" /></g></svg>
