{
	"artifacts" : 
	[
		{
			"path" : "Lab3"
		}
	],
	"backtrace" : 4,
	"backtraceGraph" : 
	{
		"commands" : 
		[
			"add_executable",
			"_qt_internal_create_executable",
			"qt6_add_executable",
			"qt_add_executable",
			"install",
			"target_link_libraries",
			"set_target_properties",
			"include",
			"find_package",
			"set_property",
			"find_dependency",
			"_qt_internal_find_third_party_dependencies",
			"_qt_internal_find_qt_dependencies"
		],
		"files" : 
		[
			"/usr/lib64/cmake/Qt6Core/Qt6CoreMacros.cmake",
			"CMakeLists.txt",
			"/usr/lib64/cmake/Qt6Widgets/Qt6WidgetsTargets.cmake",
			"/usr/lib64/cmake/Qt6Widgets/Qt6WidgetsConfig.cmake",
			"/usr/lib64/cmake/Qt6/Qt6Config.cmake",
			"/usr/share/cmake/Modules/FindOpenGL.cmake",
			"/usr/lib64/cmake/Qt6/FindWrapOpenGL.cmake",
			"/usr/share/cmake/Modules/CMakeFindDependencyMacro.cmake",
			"/usr/lib64/cmake/Qt6/QtPublicDependencyHelpers.cmake",
			"/usr/lib64/cmake/Qt6Gui/Qt6GuiDependencies.cmake",
			"/usr/lib64/cmake/Qt6Gui/Qt6GuiConfig.cmake",
			"/usr/lib64/cmake/Qt6Widgets/Qt6WidgetsDependencies.cmake"
		],
		"nodes" : 
		[
			{
				"file" : 1
			},
			{
				"command" : 3,
				"file" : 1,
				"line" : 24,
				"parent" : 0
			},
			{
				"command" : 2,
				"file" : 0,
				"line" : 741,
				"parent" : 1
			},
			{
				"command" : 1,
				"file" : 0,
				"line" : 549,
				"parent" : 2
			},
			{
				"command" : 0,
				"file" : 0,
				"line" : 588,
				"parent" : 3
			},
			{
				"command" : 4,
				"file" : 1,
				"line" : 56,
				"parent" : 0
			},
			{
				"command" : 5,
				"file" : 1,
				"line" : 46,
				"parent" : 0
			},
			{
				"command" : 8,
				"file" : 1,
				"line" : 14,
				"parent" : 0
			},
			{
				"file" : 4,
				"parent" : 7
			},
			{
				"command" : 8,
				"file" : 4,
				"line" : 167,
				"parent" : 8
			},
			{
				"file" : 3,
				"parent" : 9
			},
			{
				"command" : 7,
				"file" : 3,
				"line" : 62,
				"parent" : 10
			},
			{
				"file" : 2,
				"parent" : 11
			},
			{
				"command" : 6,
				"file" : 2,
				"line" : 70,
				"parent" : 12
			},
			{
				"command" : 5,
				"file" : 0,
				"line" : 550,
				"parent" : 2
			},
			{
				"command" : 7,
				"file" : 3,
				"line" : 50,
				"parent" : 10
			},
			{
				"file" : 11,
				"parent" : 15
			},
			{
				"command" : 12,
				"file" : 11,
				"line" : 39,
				"parent" : 16
			},
			{
				"command" : 10,
				"file" : 8,
				"line" : 111,
				"parent" : 17
			},
			{
				"command" : 8,
				"file" : 7,
				"line" : 76,
				"parent" : 18
			},
			{
				"file" : 10,
				"parent" : 19
			},
			{
				"command" : 7,
				"file" : 10,
				"line" : 50,
				"parent" : 20
			},
			{
				"file" : 9,
				"parent" : 21
			},
			{
				"command" : 11,
				"file" : 9,
				"line" : 30,
				"parent" : 22
			},
			{
				"command" : 10,
				"file" : 8,
				"line" : 36,
				"parent" : 23
			},
			{
				"command" : 8,
				"file" : 7,
				"line" : 76,
				"parent" : 24
			},
			{
				"file" : 6,
				"parent" : 25
			},
			{
				"command" : 8,
				"file" : 6,
				"line" : 13,
				"parent" : 26
			},
			{
				"file" : 5,
				"parent" : 27
			},
			{
				"command" : 9,
				"file" : 5,
				"line" : 682,
				"parent" : 28
			},
			{
				"command" : 6,
				"file" : 5,
				"line" : 680,
				"parent" : 28
			}
		]
	},
	"compileGroups" : 
	[
		{
			"compileCommandFragments" : 
			[
				{
					"fragment" : "-DQT_QML_DEBUG -g -std=gnu++17"
				}
			],
			"defines" : 
			[
				{
					"backtrace" : 14,
					"define" : "QT_CORE_LIB"
				},
				{
					"backtrace" : 6,
					"define" : "QT_GUI_LIB"
				},
				{
					"backtrace" : 6,
					"define" : "QT_WIDGETS_LIB"
				}
			],
			"includes" : 
			[
				{
					"backtrace" : 0,
					"path" : "/home/blade/Uni-20-1/7-th_semester/CrossPlatformProgramming/Lab3/build-Lab3-Desktop-Debug/Lab3_autogen/include"
				},
				{
					"backtrace" : 14,
					"isSystem" : true,
					"path" : "/usr/include/qt6/QtCore"
				},
				{
					"backtrace" : 14,
					"isSystem" : true,
					"path" : "/usr/include/qt6"
				},
				{
					"backtrace" : 14,
					"isSystem" : true,
					"path" : "/usr/lib64/qt6/mkspecs/linux-g++"
				},
				{
					"backtrace" : 6,
					"isSystem" : true,
					"path" : "/usr/include/qt6/QtWidgets"
				},
				{
					"backtrace" : 6,
					"isSystem" : true,
					"path" : "/usr/include/qt6/QtGui"
				}
			],
			"language" : "CXX",
			"languageStandard" : 
			{
				"backtraces" : 
				[
					14,
					14
				],
				"standard" : "17"
			},
			"sourceIndexes" : 
			[
				0,
				1,
				2
			]
		}
	],
	"dependencies" : 
	[
		{
			"backtrace" : 0,
			"id" : "Lab3_autogen::@6890427a1f51a3e7e1df"
		}
	],
	"id" : "Lab3::@6890427a1f51a3e7e1df",
	"install" : 
	{
		"destinations" : 
		[
			{
				"backtrace" : 5,
				"path" : "bin"
			}
		],
		"prefix" : 
		{
			"path" : "/usr/local"
		}
	},
	"link" : 
	{
		"commandFragments" : 
		[
			{
				"fragment" : "-DQT_QML_DEBUG -g",
				"role" : "flags"
			},
			{
				"fragment" : "",
				"role" : "flags"
			},
			{
				"backtrace" : 6,
				"fragment" : "/usr/lib64/libQt6Widgets.so.6.5.2",
				"role" : "libraries"
			},
			{
				"backtrace" : 13,
				"fragment" : "/usr/lib64/libQt6Gui.so.6.5.2",
				"role" : "libraries"
			},
			{
				"backtrace" : 14,
				"fragment" : "/usr/lib64/libQt6Core.so.6.5.2",
				"role" : "libraries"
			},
			{
				"backtrace" : 29,
				"fragment" : "/usr/lib64/libGLX.so",
				"role" : "libraries"
			},
			{
				"backtrace" : 30,
				"fragment" : "/usr/lib64/libOpenGL.so",
				"role" : "libraries"
			}
		],
		"language" : "CXX"
	},
	"name" : "Lab3",
	"nameOnDisk" : "Lab3",
	"paths" : 
	{
		"build" : ".",
		"source" : "."
	},
	"sourceGroups" : 
	[
		{
			"name" : "Source Files",
			"sourceIndexes" : 
			[
				0,
				1,
				2
			]
		},
		{
			"name" : "Header Files",
			"sourceIndexes" : 
			[
				3,
				5
			]
		},
		{
			"name" : "",
			"sourceIndexes" : 
			[
				4
			]
		}
	],
	"sources" : 
	[
		{
			"backtrace" : 0,
			"compileGroupIndex" : 0,
			"isGenerated" : true,
			"path" : "/home/blade/Uni-20-1/7-th_semester/CrossPlatformProgramming/Lab3/build-Lab3-Desktop-Debug/Lab3_autogen/mocs_compilation.cpp",
			"sourceGroupIndex" : 0
		},
		{
			"backtrace" : 4,
			"compileGroupIndex" : 0,
			"path" : "main.cpp",
			"sourceGroupIndex" : 0
		},
		{
			"backtrace" : 4,
			"compileGroupIndex" : 0,
			"path" : "mainwindow.cpp",
			"sourceGroupIndex" : 0
		},
		{
			"backtrace" : 4,
			"path" : "mainwindow.h",
			"sourceGroupIndex" : 1
		},
		{
			"backtrace" : 4,
			"path" : "mainwindow.ui",
			"sourceGroupIndex" : 2
		},
		{
			"backtrace" : 0,
			"isGenerated" : true,
			"path" : "/home/blade/Uni-20-1/7-th_semester/CrossPlatformProgramming/Lab3/build-Lab3-Desktop-Debug/Lab3_autogen/include/ui_mainwindow.h",
			"sourceGroupIndex" : 1
		}
	],
	"type" : "EXECUTABLE"
}
