{
	"configurations" : 
	[
		{
			"directories" : 
			[
				{
					"build" : ".",
					"hasInstallRule" : true,
					"jsonFile" : "directory-.-Debug-7385f45f734e7ef46298.json",
					"minimumCMakeVersion" : 
					{
						"string" : "3.16"
					},
					"projectIndex" : 0,
					"source" : ".",
					"targetIndexes" : 
					[
						0,
						1
					]
				}
			],
			"name" : "Debug",
			"projects" : 
			[
				{
					"directoryIndexes" : 
					[
						0
					],
					"name" : "Lab2",
					"targetIndexes" : 
					[
						0,
						1
					]
				}
			],
			"targets" : 
			[
				{
					"directoryIndex" : 0,
					"id" : "Lab2::@6890427a1f51a3e7e1df",
					"jsonFile" : "target-Lab2-Debug-fb196be1391e0a7be905.json",
					"name" : "Lab2",
					"projectIndex" : 0
				},
				{
					"directoryIndex" : 0,
					"id" : "Lab2_autogen::@6890427a1f51a3e7e1df",
					"jsonFile" : "target-Lab2_autogen-Debug-d0ce80808ac084ce4c54.json",
					"name" : "Lab2_autogen",
					"projectIndex" : 0
				}
			]
		}
	],
	"kind" : "codemodel",
	"paths" : 
	{
		"build" : "/home/blade/Uni-20-1/7-th_semester/CrossPlatformProgramming/Lab2/build-Lab2-Desktop-Debug",
		"source" : "/home/blade/Uni-20-1/7-th_semester/CrossPlatformProgramming/Lab2/Lab2"
	},
	"version" : 
	{
		"major" : 2,
		"minor" : 6
	}
}
