Country,Mortality from CVD/cancer/diabetes ,Suicide mortality,Alcohol consumption per capita,Death from road accidents,Health coverage,Death from unintentional poisoning
Afghanistan,"35,30","4,10","0,10","15,90","37,00",1
Albania,"11,40","4,30","6,80","11,70","62,00","0,3"
Algeria,"13,90","2,50","0,60","20,90","75,00","0,7"
Angola,"22,20","6,10","7,80","26,10","39,00",2
Antigua and Barbuda,"17,50","0,40","9,40","0,00","72,00","0,7"
Argentina,"15,70","8,40","9,50","14,10","73,00","0,4"
Armenia,"19,90","3,30","4,70","20,00","69,00","0,7"
Australia,"8,60","12,50","10,40","4,90","87,00","0,1"
Austria,"10,40","14,60","11,90","4,90","82,00","0,2"
Azerbaijan,"27,20","4,10","1,00","6,70","65,00","0,9"
The Bahamas,"19,90","3,50","4,80","7,70","70,00","0,2"
Bahrain,"16,10","8,90","1,10","5,20","71,00","0,3"
Bangladesh,"18,90","3,70","0,00","15,30","51,00","0,3"
Barbados,"16,00","0,60","10,40","8,20","74,00","0,7"
Belarus,"23,80","21,20","11,00","7,60","74,00","3,3"
Belgium,"10,60","18,30","10,80","5,80","85,00","0,4"
Belize,"16,50","7,10","6,40","22,60","67,00","0,4"
Benin,"22,60","7,80","2,20","26,80","38,00","2,6"
Bhutan,"18,50","4,60","0,20","16,20","62,00","0,2"
Bolivia (multinational State),"17,90","6,20","3,90","21,10","67,00","0,6"
Bosnia and Herzegovina,"18,70","10,90","7,80","13,50","65,00","0,4"
Botswana,"27,00","16,10","6,60","26,40","54,00","1,8"
Brazil,"15,50","6,90","7,30","16,00","75,00","0,1"
Brunei Darussalam,"18,50","2,70","0,50","7,50","77,00","0,1"
Bulgaria,"24,20","9,70","12,50","9,20","70,00","0,5"
Burkina Faso,"23,90","7,50","11,00","31,00","43,00","3,1"
Burundi,"25,00","6,20","7,50","35,50","44,00","3,2"
Cape Verde,"17,40","12,90","6,40","26,80","69,00","0,4"
Cambodia,"22,50","4,80","7,80","19,60","61,00","0,5"
Cameroon,"23,90","9,00","5,50","30,20","44,00","2,6"
Canada,"9,60","11,80","8,80","5,30","89,00","0,3"
Central African Republic,"36,00","12,30","1,70","37,70","32,00","2,8"
Chad,"22,70","6,40","1,30","32,40","28,00","3,5"
Chile,"10,00","9,00","8,90","14,90","80,00","0,4"
China,"15,90","8,10","6,00","17,40","82,00","1,8"
Colombia,"9,70","3,90","5,50","15,40","78,00","0,1"
Comoros,"20,60","5,40","1,10","26,60","44,00","2,4"
Congo,"22,60","6,50","9,20","29,70","40,00","1,3"
Costa Rica,"9,50","8,10","4,10","14,80","78,00","0,1"
Ivory Coast,"21,70","8,90","3,00","24,10","45,00","2,5"
Croatia,"16,10","16,40","8,70","7,90","73,00","0,4"
Cuba,"16,60","14,50","6,30","8,90","80,00","0,2"
Cyprus,"8,20","3,60","10,80","5,80","79,00","0,3"
Czech,"14,30","12,20","14,30","5,90","78,00","0,4"
Democratic People's Republic of Korea,"23,90","9,40","4,20","24,20","68,00","1,4"
Democratic Republic of the Congo,"24,00","6,70","1,10","34,90","39,00",2
Denmark,"10,80","10,70","10,10","3,70","85,00","0,1"
Djibouti,"22,00","9,60","0,40","23,50","48,00","2,5"
Dominican Republic,"19,10","4,90","6,70","64,60","66,00","0,4"
Ecuador,"11,00","7,60","3,30","20,10","80,00","0,3"
Egypt,"28,00","3,00","0,10","10,10","70,00","0,2"
El Salvador,"10,70","6,00","4,10","20,90","76,00","0,2"
Equatorial Guinea,"22,10","7,90","6,90","27,20","43,00","1,6"
Eritrea,"26,80","10,90","2,10","37,90","50,00","3,3"
Estonia,"14,90","14,90","10,80","4,50","78,00","0,6"
Eswatini,"35,20","29,40","8,80","33,50","58,00","3,3"
Ethiopia,"17,10","5,40","2,20","28,20","38,00","3,3"
Fiji,"37,70","9,00","3,70","13,50","61,00","0,3"
Finland,"9,60","15,30","10,70","3,90","83,00","0,4"
France,"10,60","13,80","12,20","5,10","84,00","0,3"
Gabon,"21,30","8,40","8,10","23,90","49,00","1,3"
Gambia,"21,10","4,80","3,40","29,60","48,00","1,8"
Georgia,"24,90","9,20","9,50","12,40","65,00","0,6"
Germany,"12,10","12,30","12,80","3,80","86,00","0,3"
Ghana,"22,50","6,60","2,80","25,70","45,00","1,7"
Greece,"12,50","5,10","10,50","8,30","78,00","0,2"
Grenada,"23,30","0,70","9,00","8,00","70,00","0,1"
Guatemala,"16,50","5,90","1,60","22,90","57,00","1,6"
Guinea,"24,90","7,00","1,10","29,70","37,00","2,3"
Guinea-Bissau,"24,90","7,00","5,50","32,20","37,00","2,3"
Guyana,"29,20","40,30","5,30","22,30","74,00","0,1"
Haiti,"31,30","9,60","3,00","18,80","47,00","1,4"
Honduras,"18,70","2,10","3,90","16,10","63,00","0,5"
Hungary,"22,10","16,60","11,10","7,70","73,00","0,5"
Iceland,"8,70","11,90","9,20","2,00","87,00",1
India,"21,90","12,70","5,60","15,60","61,00","0,3"
Indonesia,"24,80","2,40","0,20","11,30","59,00","0,3"
Iran (Islamic Republic of),"14,80","5,20","1,00","21,50","77,00",1
Iraq,"23,50","3,60","0,40","27,30","55,00","0,2"
Irish,"9,70","9,60","12,70","3,10","83,00","0,3"
Israel,"8,80","5,30","4,40","3,90","84,00","0,1"
Italy,"9,00","6,70","8,00","5,30","83,00","0,3"
Jamaica,"16,90","2,40","4,20","15,10","70,00","0,1"
Japan,"8,30","15,30","10,10","3,60","85,00","0,2"
Jordan,"15,30","1,60","0,50","17,00","60,00","0,5"
Kazakhstan,"22,40","17,60","5,00","12,70","76,00","1,9"
Kenya,"21,00","6,10","2,10","28,30","56,00","2,4"
Kiribati,"50,80","28,30","2,30","1,90","51,00","2,6"
Kuwait,"11,90","2,90","0,00","15,40","70,00","0,4"
Kyrgyzstan,"20,30","7,40","4,90","12,70","70,00","0,9"
Lao People's Democratic Republic,"26,80","5,40","12,10","17,90","50,00","0,6"
Latvia,"21,60","20,10","13,20","8,10","72,00","1,2"
Lebanon,"19,90","2,80","1,50","16,40","72,00","0,6"
Lesotho,"42,70","72,40","5,10","31,90","48,00","5,2"
Liberia,"17,80","4,40","5,40","38,90","42,00","1,7"
Libya,"18,60","4,50","0,10","21,30","60,00","0,8"
Lithuania,"19,30","26,10","12,80","8,10","70,00","1,7"
Luxembourg,"9,70","11,30","12,40","4,10","86,00","0,2"
Madagascar,"26,00","5,50","2,00","29,20","35,00","2,1"
Malawi,"22,60","5,40","4,10","33,40","48,00","1,7"
Malaysia,"18,40","5,70","0,90","22,50","76,00","0,7"
Maldives,"11,60","2,70","2,80","1,60","69,00","0,1"
Mali,"22,30","4,10","1,30","22,70","42,00","2,9"
Malta,"10,50","6,10","8,30","4,10","81,00","0,1"
Mauritania,"16,10","3,10","0,00","25,60","40,00","1,5"
Mauritius,"23,20","9,50","4,80","12,20","65,00","0,8"
Mexico,"15,60","5,30","5,00","12,80","74,00","0,4"
Micronesia (Federated States of),"46,30","28,20","2,50","0,20","48,00","0,9"
Mongolia,"35,00","17,90","5,90","21,00","63,00","2,8"
Montenegro,"22,30","21,00","12,20","7,60","67,00","0,6"
Morocco,"24,10","7,20","0,50","17,00","73,00","0,7"
Mozambique,"30,60","13,60","2,70","30,00","47,00","3,7"
Myanmar,"24,90","2,90","2,10","20,40","61,00","1,3"
Namibia,"22,60","9,70","3,10","34,80","62,00","1,9"
Nepal,"21,50","9,00","0,60","16,30","53,00","1,7"
Netherlands,"10,30","11,80","9,70","4,00","86,00","0,1"
New Zealand,"10,30","11,00","10,70","9,60","86,00","0,2"
Nicaragua,"15,30","4,30","5,10","16,90","70,00","0,3"
Niger,"21,00","5,30","0,50","25,50","37,00","3,3"
Nigeria,"16,90","3,50","6,20","20,70","44,00","3,3"
Northern Macedonia,"22,70","9,40","6,40","5,10","68,00","0,5"
Norway,"8,70","11,80","7,10","2,10","86,00","0,3"
Oman,"21,50","4,80","0,90","10,60","69,00","0,9"
Pakistan,"29,40","8,90","0,30","13,00","45,00","1,6"
Panama hat,"10,70","2,90","7,80","13,90","77,00","0,1"
Papua New Guinea,"36,00","3,00","2,10","12,60","33,00","1,4"
Paraguay,"16,00","6,00","7,00","22,00","61,00","0,2"
Peru,"9,70","2,80","6,80","13,60","78,00","0,4"
Philippines,"24,50","2,10","7,00","12,00","55,00","0,2"
Poland,"17,00","11,30","11,90","9,40","74,00","0,5"
Portugal,"11,00","11,50","12,10","8,20","84,00","0,3"
Qatar,"10,70","5,80","1,50","7,30","74,00","0,3"
Republic of Korea,"7,30","28,60","8,50","8,60","87,00","0,2"
Republic of Moldova,"24,10","14,70","12,90","7,30","67,00","5,5"
Romania,"21,00","9,70","12,30","10,30","71,00","1,9"
Russian Federation,"24,20","25,10","10,50","12,00","75,00","3,8"
Rwanda,"20,20","5,60","8,00","29,40","54,00","1,7"
Saint Lucia,"17,70","7,90","9,60","29,80","72,00","0,1"
Saint Vincent and the Grenadines,"20,70","1,00","7,20","7,40","73,00","0,1"
Samoa,"31,20","12,60","2,80","13,00","53,00","0,4"
Sao Tome and Principe,"21,00","1,50","5,80","27,90","60,00","0,7"
Saudi Arabia,"20,90","6,00","0,00","35,90","73,00","0,8"
Senegal,"19,50","6,00","0,70","23,50","49,00","1,9"
Serbia,"22,00","11,40","8,90","7,50","71,00","0,3"
Seychelles,"21,10","8,10","8,80","11,30","70,00","0,5"
Sierra Leone,"23,50","6,70","5,30","33,00","39,00","2,8"
Singapore,"9,50","11,20","2,00","2,10","86,00","0,1"
Slovakia,"15,50","12,10","11,10","6,10","77,00","0,5"
Slovenia,"11,40","19,80","12,10","5,10","80,00","0,2"
Solomon Islands,"39,20","14,70","1,70","16,50","50,00","2,3"
Somalia,"30,40","7,90","0,00","27,40","27,00","4,9"
South Africa,"24,10","23,50","9,50","22,20","67,00","1,7"
Spain,"9,60","7,70","12,70","3,90","86,00","0,4"
Sri Lanka,"13,20","14,00","2,90","19,70","67,00","0,4"
Suriname,"22,70","25,40","7,40","15,30","67,00","0,3"
Sweden,"8,40","14,70","9,00","3,10","87,00","0,2"
Switzerland,"7,90","14,50","11,20","2,20","87,00","0,2"
Syrian Arab Republic,"22,10","2,00","0,20","14,90","56,00","0,6"
Tadjikistan,"28,30","4,30","0,90","15,70","66,00","0,4"
Thailand,"13,70","8,80","8,50","32,20","83,00","0,2"
Timor-Leste,"19,90","3,70","0,50","11,90","53,00","0,4"
Togo,"23,90","8,80","2,70","28,70","44,00","1,9"
Tonga,"24,80","3,80","0,40","33,00","56,00","1,1"
Trinidad and Tobago,"17,10","8,70","6,50","9,30","73,00","0,1"
Tunisia,"15,70","3,30","2,00","16,50","70,00","0,7"
Turkey,"15,60","2,40","1,80","6,70","79,00","0,4"
Turkmenistan,"27,70","5,70","3,10","13,50","73,00","0,6"
Uganda,"21,20","4,60","12,50","29,40","50,00","1,7"
Ukraine,"25,50","21,60","8,30","10,20","73,00","2,5"
United Arab Emirates,"18,50","6,40","3,80","8,90","78,00","0,4"
United Kingdom,"10,30","7,90","11,40","3,20","88,00","0,3"
United Republic of Tanzania,"17,40","4,30","12,00","31,10","46,00",2
United States of America,"13,60","16,10","10,00","12,70","83,00","0,5"
Uruguay,"16,50","21,20","6,90","14,80","79,00","0,5"
Uzbekistan,"25,30","8,00","2,60","11,70","71,00","0,8"
Vanuatu,"39,70","18,00","2,10","14,90","52,00","0,7"
Venezuela (Bolivarian Republic of),"14,80","2,00","3,60","39,00","70,00","0,2"
Vietnam,"21,20","7,50","7,90","30,60","70,00","0,9"
Yemen,"27,60","5,80","0,10","29,40","44,00","1,8"
Zambia,"24,60","7,30","4,50","20,50","55,00","2,6"
Zimbabwe,"28,40","14,10","4,50","41,20","55,00","3,5"
