{
  "packages": ["apps/*", "packages/**/**"],
  "version": "independent",
  "npmClient": "yarn",
  "command": {
    "version": {
      "allowBranch": "main",
      "message": "Publish libraries",
      "registry": "https://nexus-up.h-firework.com/repository/hli-npm-private/",
      "conventionalCommits": true
    },
    "publish": {
      "registry": "https://nexus-up.h-firework.com/repository/hli-npm-private/"
    }
  },
  "useWorkspaces": true
}
