<svg width="347" height="40" viewBox="0 0 347 40" fill="none" xmlns="http://www.w3.org/2000/svg">
<path d="M18.912 39.672C13.888 39.672 10 38.568 7.248 36.36C4.528 34.152 3.168 30.568 3.168 25.608V9.528H0.768V1.656H18.528V9.528H16.608V28.056C16.608 29.112 16.832 29.896 17.28 30.408C17.76 30.888 18.464 31.128 19.392 31.128C20.32 31.128 21.008 30.888 21.456 30.408C21.936 29.896 22.176 29.112 22.176 28.056V9.528H20.256V1.656H36.72V9.528H34.32V25.608C34.32 30.568 32.992 34.152 30.336 36.36C27.68 38.568 23.872 39.672 18.912 39.672ZM38.46 31.128H40.86V9.528H38.46V1.656H60.492C64.62 1.656 67.772 2.504 69.948 4.2C72.124 5.896 73.212 8.648 73.212 12.456C73.212 14.6 72.78 16.456 71.916 18.024C71.052 19.592 69.82 20.68 68.22 21.288L68.268 21.768C71.34 22.248 72.876 24.136 72.876 27.432V31.128H75.132V39H59.916V27.72C59.916 26.472 59.724 25.528 59.34 24.888C58.988 24.248 58.412 23.816 57.612 23.592C56.844 23.368 55.74 23.256 54.3 23.256V31.128H57.468V39H38.46V31.128ZM56.892 17.4C57.82 17.4 58.508 17.16 58.956 16.68C59.436 16.168 59.676 15.384 59.676 14.328V12.6C59.676 11.544 59.436 10.776 58.956 10.296C58.508 9.784 57.82 9.528 56.892 9.528H54.3V17.4H56.892ZM93.162 39.672C88.138 39.672 84.25 38.568 81.498 36.36C78.778 34.152 77.418 30.568 77.418 25.608V9.528H75.018V1.656H92.778V9.528H90.858V28.056C90.858 29.112 91.082 29.896 91.53 30.408C92.01 30.888 92.714 31.128 93.642 31.128C94.57 31.128 95.258 30.888 95.706 30.408C96.186 29.896 96.426 29.112 96.426 28.056V9.528H94.506V1.656H110.97V9.528H108.57V25.608C108.57 30.568 107.242 34.152 104.586 36.36C101.93 38.568 98.122 39.672 93.162 39.672ZM165.654 9.528H163.254V31.128H165.654V39H147.51V31.128H149.814V14.328L141.654 39H134.55L126.15 14.568V31.128H128.454V39H112.71V31.128H115.11V9.528H112.71V1.656H134.694L139.686 16.632L144.486 1.656H165.654V9.528ZM202.786 31.128H204.706V39H185.89V31.128H188.77L188.002 27.288H181.474L180.706 31.128H183.586V39H167.17V31.128H169.09L177.202 1.656H194.674L202.786 31.128ZM182.53 22.2H186.946L184.978 12.648H184.498L182.53 22.2ZM221.106 39.672C218.034 39.672 215.122 39.416 212.37 38.904C209.65 38.36 207.554 37.752 206.082 37.08V27.576H216.642C216.642 28.568 216.866 29.288 217.314 29.736C217.762 30.184 218.578 30.408 219.762 30.408C220.754 30.408 221.458 30.264 221.874 29.976C222.322 29.656 222.546 29.192 222.546 28.584C222.546 28.072 222.338 27.64 221.922 27.288C221.506 26.904 220.786 26.52 219.762 26.136L215.634 24.696C212.082 23.352 209.522 21.768 207.954 19.944C206.418 18.12 205.65 15.656 205.65 12.552C205.65 8.776 206.882 5.912 209.346 3.96C211.842 1.976 215.986 0.983997 221.778 0.983997C224.562 0.983997 227.17 1.272 229.602 1.848C232.066 2.392 234.05 3.128 235.554 4.056V12.648H225.954C225.954 11.048 224.962 10.248 222.978 10.248C222.018 10.248 221.33 10.376 220.914 10.632C220.53 10.856 220.338 11.272 220.338 11.88C220.338 12.424 220.562 12.856 221.01 13.176C221.49 13.496 222.258 13.832 223.314 14.184L227.49 15.624C230.882 16.776 233.346 18.28 234.882 20.136C236.45 21.96 237.234 24.36 237.234 27.336C237.234 31.4 235.858 34.472 233.106 36.552C230.386 38.632 226.386 39.672 221.106 39.672ZM274.377 13.272H266.121V9.528H263.049V31.128H266.409V39H246.249V31.128H249.609V9.528H246.537V13.272H238.281V1.656H274.377V13.272ZM276.023 39V31.128H278.423V9.528H276.023V1.656H308.423V16.152H297.671V9.528H291.863V17.112H296.087V22.584H291.863V31.128H297.671V23.544H308.423V39H276.023ZM310.241 31.128H312.641V9.528H310.241V1.656H332.273C336.401 1.656 339.553 2.504 341.729 4.2C343.905 5.896 344.993 8.648 344.993 12.456C344.993 14.6 344.561 16.456 343.697 18.024C342.833 19.592 341.601 20.68 340.001 21.288L340.049 21.768C343.121 22.248 344.657 24.136 344.657 27.432V31.128H346.913V39H331.697V27.72C331.697 26.472 331.505 25.528 331.121 24.888C330.769 24.248 330.193 23.816 329.393 23.592C328.625 23.368 327.521 23.256 326.081 23.256V31.128H329.249V39H310.241V31.128ZM328.673 17.4C329.601 17.4 330.289 17.16 330.737 16.68C331.217 16.168 331.457 15.384 331.457 14.328V12.6C331.457 11.544 331.217 10.776 330.737 10.296C330.289 9.784 329.601 9.528 328.673 9.528H326.081V17.4H328.673Z" fill="white"/>
</svg>
