{
  "exec": "node --inspect=5860 -r ts-node/register -r tsconfig-paths/register",
  "ext": "js ts",
  "watch": [
    "src/server/**/*"
  ],
  "env": {
    "NODE_ENV": "development",
    "NODE_CONFIG_ENV": "development"
  }
}
