{
	"authors": [
		"Serpent OS Developers"
	],
	"copyright": "Copyright © 2022, Serpent OS Developers",
	"description": "Serpent OS Onboarding",
	"license": "Zlib",
	"name": "snek",
	"libs-posix": [
		"libcurl"
	]
}
