Node is bootstrapped.
Estimated gas: 1000 units (will add 0 for safety)
Estimated storage: no bytes added
Operation successfully injected in the node.
Operation hash is 'ooaB1EZhB4xGAr4FzEiPuT8CdwFxj5dmAoWYBqCKexohZt24o5K'
NOT waiting for the operation to be included.
Use command
  tezos-client wait for ooaB1EZhB4xGAr4FzEiPuT8CdwFxj5dmAoWYBqCKexohZt24o5K to be included --confirmations 1 --branch BLockGenesisGenesisGenesisGenesisGenesisf79b5d1CoW2
and/or an external block explorer to make sure that it has been included.
This sequence of operations was run:
  Manager signed operations:
    From: tz1gjaF81ZRRvdzjobyfVNsAeSC6PScjfQwN
    Fee to the baker: ꜩ0.000348
    Expected counter: 1
    Gas limit: 1000
    Storage limit: 0 bytes
    Balance updates:
      tz1gjaF81ZRRvdzjobyfVNsAeSC6PScjfQwN ... -ꜩ0.000348
      payload fees(the block proposer) ....... +ꜩ0.000348
    Increase paid storage:
      Bytes: : 1000
      From: tz1gjaF81ZRRvdzjobyfVNsAeSC6PScjfQwN
      To: KT1NveRFUkyV37m2kiKFFn2zsqm1wFmkp4Lk
      This paid storage increase was successfully applied
      Balance updates:
        tz1gjaF81ZRRvdzjobyfVNsAeSC6PScjfQwN ... -ꜩ0.25
        storage fees ........................... +ꜩ0.25
      Consumed gas: 1000


