<?xml version="1.0" encoding="utf-8"?>
<!-- Generator: Adobe Illustrator 16.0.0, SVG Export Plug-In . SVG Version: 6.00 Build 0)  -->
<!DOCTYPE svg PUBLIC "-//W3C//DTD SVG 1.1//EN" "http://www.w3.org/Graphics/SVG/1.1/DTD/svg11.dtd">
<svg version="1.1" id="Layer_1" xmlns="http://www.w3.org/2000/svg" xmlns:xlink="http://www.w3.org/1999/xlink" x="0px" y="0px"
	 width="200px" height="200px" viewBox="0 0 200 200" enable-background="new 0 0 200 200" xml:space="preserve">
<g opacity="0.2">
	<g>
		<path fill="#B6BF7E" d="M75.612,65.755c0,0,0,0,23.337,0C83.489,32.208,49.212,8.288,40.897,14.997
			C31.04,22.95,67.154,28.805,75.612,65.755z"/>
		<path fill="#B6BF7E" d="M124.388,65.755c0,0,0,0-23.337,0c15.461-33.547,49.736-57.467,58.052-50.758
			C168.959,22.95,132.846,28.805,124.388,65.755z"/>
	</g>
	<g>
		<path fill="#B6BF7E" d="M47.492,64.296l22.113,84.596c0,0,14.351-12.252,30.395-11.377
			C97.667,115.638,91.541,71.297,47.492,64.296z"/>
		<path fill="#B6BF7E" d="M152.508,64.296l-22.113,84.596c0,0-14.351-12.252-30.395-11.377
			C102.334,115.638,108.46,71.297,152.508,64.296z"/>
	</g>
	<g>
		<path fill="#B6BF7E" d="M0,54.67c13.71-7.293,38.976,2.625,38.976,23.337C16.044,82.966,0,67.505,0,54.67z"/>
		<path fill="#B6BF7E" d="M200,54.67c-13.71-7.293-38.976,2.625-38.976,23.337C183.956,82.966,200,67.505,200,54.67z"/>
	</g>
	<path fill="#B6BF7E" d="M70.624,155.019c0,0,5.999-11.669,29.871-11.669c22.658,0,28.88,11.669,28.88,11.669l-5.056,19.447
		c0,0-3.114,11.669-23.825,11.669s-24.211-11.669-24.211-11.669L70.624,155.019z"/>
</g>
</svg>
