<?xml version="1.0" encoding="utf-8"?>
<!-- Generator: Adobe Illustrator 16.0.0, SVG Export Plug-In . SVG Version: 6.00 Build 0)  -->
<!DOCTYPE svg PUBLIC "-//W3C//DTD SVG 1.1//EN" "http://www.w3.org/Graphics/SVG/1.1/DTD/svg11.dtd">
<svg version="1.1" id="Layer_1" xmlns="http://www.w3.org/2000/svg" xmlns:xlink="http://www.w3.org/1999/xlink" x="0px" y="0px"
	 width="100px" height="100px" viewBox="-37.5 -25 100 100" enable-background="new -37.5 -25 100 100" xml:space="preserve">
<title>new icons cheese_1</title>
<desc>Created with Sketch.</desc>
<g id="Новая-эстетика">
	<g id="Рецепты" transform="translate(-77.000000, -133.000000)">
		<g id="new-icons-cheese_1" transform="translate(77.000000, 133.000000)">
			<polygon id="Shape" fill="#FDD91E" points="-12.631,3.612 -3.018,-18.308 30.214,-15.674 21.263,7.86 			"/>
			
				<linearGradient id="Shape_7_" gradientUnits="userSpaceOnUse" x1="-68.0273" y1="113.3389" x2="-70.3285" y2="115.2818" gradientTransform="matrix(16.7623 0 0 -35.2521 1165.3979 4068.0137)">
				<stop  offset="0.1882" style="stop-color:#BAD3E8"/>
				<stop  offset="1" style="stop-color:#FDD91E"/>
			</linearGradient>
			<polygon id="Shape_1_" fill="url(#Shape_7_)" points="-11.554,65.294 21.097,74.895 21.263,7.86 -12.631,3.612 			"/>
			<polygon id="Shape_2_" fill="#3A3D70" points="21.097,74.895 37.672,59.092 37.672,0.979 21.263,7.86 			"/>
			<path id="Shape_3_" fill="#3A3D70" d="M0.628-7.008L4.026-2.08c0,0,4.226,3.398,9.115-1.529c4.891-4.928-1.077-9.856-1.077-9.856
				L0.628-7.008z"/>
			<path id="Shape_4_" fill="#FFFFFF" d="M9.578-14.91c-4.475-1.189-9.364,2.379-9.613,5.268c-0.249,2.889,2.32,5.948,8.287,4.249
				C14.304-7.093,14.634-13.465,9.578-14.91z"/>
			<polygon id="Shape_5_" fill="#BAD3E8" points="-3.018,-18.308 -3.101,-25.105 30.214,-22.641 30.214,-15.674 			"/>
			<polygon id="Shape_6_" fill="#3A3D70" points="37.672,0.979 30.214,-15.674 21.263,7.86 			"/>
		</g>
	</g>
</g>
</svg>
