[gd_resource type="SpatialMaterial" load_steps=2 format=2]

[ext_resource path="res://KkjzK40.jpg" type="Texture" id=1]

[resource]
flags_transparent = true
albedo_color = Color( 1, 1, 1, 0.52549 )
albedo_texture = ExtResource( 1 )
metallic = 0.65
uv1_scale = Vector3( 3.99, -4, 1 )
uv1_offset = Vector3( 5.5, 3.96, 4 )
