[gd_scene load_steps=2 format=2]

[ext_resource path="res://Scenes/Menus/TitleScreen/MenuInterface/SubMenus/MainMenu/MainMenu.tscn" type="PackedScene" id=1]

[node name="MenuViewport" type="Viewport"]
size = Vector2( 1280, 720 )
disable_3d = true
usage = 0
render_target_v_flip = true

[node name="MenuInterface" parent="." instance=ExtResource( 1 )]
