[gd_scene load_steps=2 format=2]

[ext_resource path="res://Scenes/Singletons/NetworkController/NetworkController.gd" type="Script" id=1]


[node name="NetworkController" type="Node2D"]
script = ExtResource( 1 )
