[gd_scene load_steps=5 format=2]

[ext_resource path="res://Assets/Materials/shotgunparticlered.material" type="Material" id=1]
[ext_resource path="res://Scenes/Characters/Player/ShotgunParticles/CPUShotgunParticles.gd" type="Script" id=2]

[sub_resource type="CubeMesh" id=1]
lightmap_size_hint = Vector2( 0.2, 0.2 )
material = ExtResource( 1 )
size = Vector3( 0.1, 0.1, 0.1 )

[sub_resource type="Gradient" id=2]
colors = PoolColorArray( 0, 1, 0.165039, 1, 1, 0.375, 0, 0 )

[node name="shotgunparticles" type="CPUParticles"]
emitting = false
amount = 128
one_shot = true
explosiveness = 1.0
fract_delta = false
local_coords = false
mesh = SubResource( 1 )
spread = 180.0
gravity = Vector3( 0, 0, 0 )
initial_velocity = 9.0
initial_velocity_random = 1.0
angular_velocity = 24.29
tangential_accel_random = 1.0
damping = 11.24
damping_random = 0.1
angle = 180.0
angle_random = 1.0
color_ramp = SubResource( 2 )
script = ExtResource( 2 )
