[gd_scene load_steps=2 format=2]

[ext_resource path="res://Scenes/GridMaps/GridMap1/GridMap.tres" type="MeshLibrary" id=1]

[node name="GridMap" type="GridMap"]
mesh_library = ExtResource( 1 )
data = {
"cells": PoolIntArray(  )
}
__meta__ = {
"_editor_clip_": 0
}
