[gd_resource type="CubeMesh" load_steps=2 format=2]

[ext_resource path="res://Assets/Materials/shotgunparticlegreen.material" type="Material" id=1]


[resource]
lightmap_size_hint = Vector2( 0.2, 0.2 )
material = ExtResource( 1 )
size = Vector3( 0.1, 0.1, 0.1 )
