<svg width="24" height="24" viewBox="0 0 24 24" fill="none" xmlns="http://www.w3.org/2000/svg">
<rect width="24" height="24" />
<path d="M13.2222 23V10.7778H23V23H13.2222ZM1 13.2222V1H10.7778V13.2222H1ZM8.33333 10.7778V3.44444H3.44444V10.7778H8.33333ZM1 23V15.6667H10.7778V23H1ZM3.44444 20.5556H8.33333V18.1111H3.44444V20.5556ZM15.6667 20.5556H20.5556V13.2222H15.6667V20.5556ZM13.2222 1H23V8.33333H13.2222V1ZM15.6667 3.44444V5.88889H20.5556V3.44444H15.6667Z" fill="#DDA0DD"/>
</svg>
