// Jest Snapshot v1, https://goo.gl/fbAQLP

exports[`Button render test should button render 1`] = `
<DocumentFragment>
  <button
    class="active"
  >
    ButtonTest
  </button>
</DocumentFragment>
`;
