<svg width="98" height="98" viewBox="0 0 98 98" fill="none" xmlns="http://www.w3.org/2000/svg">
<g filter="url(#filter0_d_1_540)">
<path d="M20 48C20 61.7858 31.2142 73 45 73C58.7858 73 70 61.7858 70 48C70 34.2142 58.7839 23 45 23C31.2161 23 20 34.2142 20 48ZM66.1271 48C66.1271 59.6479 56.6499 69.127 45 69.127C33.3501 69.1271 23.8729 59.6479 23.8729 48C23.8729 36.3501 33.3501 26.8729 45 26.8729C56.6499 26.8729 66.127 36.352 66.1271 48Z" fill="#6652DA" fill-opacity="0.7"/>
<path d="M47.6727 36.9429L37.9903 46.6253C37.2389 47.3806 37.2389 48.6005 37.9903 49.3558L47.6727 59.0382C48.3969 59.6598 49.4678 59.6598 50.192 59.0382C51.0035 58.343 51.0983 57.1192 50.4031 56.3077L42.0957 48.0002L50.4032 39.6734C51.1545 38.9181 51.1545 37.6982 50.4032 36.9429C49.6479 36.1915 48.4279 36.1915 47.6727 36.9429Z" fill="#6652DA" fill-opacity="0.7"/>
</g>
<defs>
<filter id="filter0_d_1_540" x="0" y="0" width="98" height="98" filterUnits="userSpaceOnUse" color-interpolation-filters="sRGB">
<feFlood flood-opacity="0" result="BackgroundImageFix"/>
<feColorMatrix in="SourceAlpha" type="matrix" values="0 0 0 0 0 0 0 0 0 0 0 0 0 0 0 0 0 0 127 0" result="hardAlpha"/>
<feMorphology radius="2" operator="dilate" in="SourceAlpha" result="effect1_dropShadow_1_540"/>
<feOffset dx="4" dy="1"/>
<feGaussianBlur stdDeviation="11"/>
<feColorMatrix type="matrix" values="0 0 0 0 0.938472 0 0 0 0 0.954653 0 0 0 0 0.970833 0 0 0 1 0"/>
<feBlend mode="normal" in2="BackgroundImageFix" result="effect1_dropShadow_1_540"/>
<feBlend mode="normal" in="SourceGraphic" in2="effect1_dropShadow_1_540" result="shape"/>
</filter>
</defs>
</svg>
