<svg width="46" height="46" viewBox="0 0 46 46" fill="none" xmlns="http://www.w3.org/2000/svg">
<path d="M4.92863 16.6324L22.4316 25.7354C22.6072 25.8267 22.8022 25.8744 23.0001 25.8744C23.1979 25.8744 23.3929 25.8267 23.5685 25.7354L41.0715 16.634V32.4465C41.0716 33.8103 40.5498 35.1224 39.6132 36.1137C38.6765 37.105 37.3961 37.7004 36.0345 37.7776L35.7322 37.7858H10.2679C8.90412 37.7859 7.59199 37.2641 6.60068 36.3275C5.60938 35.3908 5.01406 34.1104 4.93685 32.7488L4.92863 32.4465V16.6324ZM10.2679 8.21436H35.7322C37.096 8.21427 38.4081 8.73605 39.3994 9.67267C40.3907 10.6093 40.9861 11.8897 41.0633 13.2514L41.0715 13.5536V13.8559L23.0001 23.2531L4.92863 13.8559V13.5536C4.92854 12.1898 5.45033 10.8777 6.38695 9.88641C7.32357 8.8951 8.60402 8.29978 9.96563 8.22257L10.2679 8.21436H35.7322H10.2679Z" fill="#FF7243"/>
</svg>
