{
   "$schema": "./node_modules/@angular/service-worker/config/schema.json",
   "index": "/index.html",
   "assetGroups": [
      {
         "name": "app",
         "installMode": "prefetch",
         "resources": {
            "files": [
               "/favicon.ico",
               "/index.html",
               "/manifest.webmanifest",
               "/*.css",
               "/*.js"
            ]
         }
      },
      {
         "name": "assets",
         "installMode": "lazy",
         "updateMode": "prefetch",
         "resources": {
            "files": [
               "/assets/**",
               "/*.(eot|svg|cur|jpg|png|webp|gif|otf|ttf|woff|woff2|ani)"
            ]
         }
      }
   ],
   "dataGroups": [
      {
         "name": "datafetch",
         "urls": [
            "http://127.0.0.1:8080/**"
         ],
         "cacheConfig": {
            "strategy": "freshness",
            "maxAge": "1d",
            "maxSize": 10
         }
      }
   ]
}