^D:\PROJECTS\VISUALSTUDIO\TCP_CLIENT\TCP_CLIENT\LINUX_PROCESS.C
/c /ZI /JMC /nologo /W3 /WX- /diagnostics:column /sdl /Od /Oy- /D WIN32 /D _DEBUG /D _CONSOLE /D _UNICODE /D UNICODE /Gm- /EHsc /RTC1 /MDd /GS /fp:precise /permissive- /Zc:wchar_t /Zc:forScope /Zc:inline /Fo"DEBUG\\" /Fd"DEBUG\VC142.PDB" /Gd /TC /analyze- /FC D:\PROJECTS\VISUALSTUDIO\TCP_CLIENT\TCP_CLIENT\LINUX_PROCESS.C
^D:\PROJECTS\VISUALSTUDIO\TCP_CLIENT\TCP_CLIENT\LINUX_SOCKET.C
/c /ZI /JMC /nologo /W3 /WX- /diagnostics:column /sdl /Od /Oy- /D WIN32 /D _DEBUG /D _CONSOLE /D _UNICODE /D UNICODE /Gm- /EHsc /RTC1 /MDd /GS /fp:precise /permissive- /Zc:wchar_t /Zc:forScope /Zc:inline /Fo"DEBUG\\" /Fd"DEBUG\VC142.PDB" /Gd /TC /analyze- /FC D:\PROJECTS\VISUALSTUDIO\TCP_CLIENT\TCP_CLIENT\LINUX_SOCKET.C
^D:\PROJECTS\VISUALSTUDIO\TCP_CLIENT\TCP_CLIENT\WINDOWS_SOCKET.C
/c /ZI /JMC /nologo /W3 /WX- /diagnostics:column /sdl /Od /Oy- /D WIN32 /D _DEBUG /D _CONSOLE /D _UNICODE /D UNICODE /Gm- /EHsc /RTC1 /MDd /GS /fp:precise /permissive- /Zc:wchar_t /Zc:forScope /Zc:inline /Fo"DEBUG\\" /Fd"DEBUG\VC142.PDB" /Gd /TC /analyze- /FC D:\PROJECTS\VISUALSTUDIO\TCP_CLIENT\TCP_CLIENT\WINDOWS_SOCKET.C
^D:\PROJECTS\VISUALSTUDIO\TCP_CLIENT\TCP_CLIENT\MAIN_CLIENT.C
/c /ZI /JMC /nologo /W3 /WX- /diagnostics:column /sdl /Od /Oy- /D WIN32 /D _DEBUG /D _CONSOLE /D _UNICODE /D UNICODE /Gm- /EHsc /RTC1 /MDd /GS /fp:precise /permissive- /Zc:wchar_t /Zc:forScope /Zc:inline /Fo"DEBUG\\" /Fd"DEBUG\VC142.PDB" /Gd /TC /analyze- /FC D:\PROJECTS\VISUALSTUDIO\TCP_CLIENT\TCP_CLIENT\MAIN_CLIENT.C
^D:\PROJECTS\VISUALSTUDIO\TCP_CLIENT\TCP_CLIENT\WINDOWS_PROCESS.C
/c /ZI /JMC /nologo /W3 /WX- /diagnostics:column /sdl /Od /Oy- /D WIN32 /D _DEBUG /D _CONSOLE /D _UNICODE /D UNICODE /Gm- /EHsc /RTC1 /MDd /GS /fp:precise /permissive- /Zc:wchar_t /Zc:forScope /Zc:inline /Fo"DEBUG\\" /Fd"DEBUG\VC142.PDB" /Gd /TC /analyze- /FC D:\PROJECTS\VISUALSTUDIO\TCP_CLIENT\TCP_CLIENT\WINDOWS_PROCESS.C
