^D:\PROJECTS\VISUALSTUDIO\TCP_CLIENT\TCP_CLIENT\DEBUG\LINUX_PROCESS.OBJ|D:\PROJECTS\VISUALSTUDIO\TCP_CLIENT\TCP_CLIENT\DEBUG\LINUX_SOCKET.OBJ|D:\PROJECTS\VISUALSTUDIO\TCP_CLIENT\TCP_CLIENT\DEBUG\MAIN_CLIENT.OBJ|D:\PROJECTS\VISUALSTUDIO\TCP_CLIENT\TCP_CLIENT\DEBUG\WINDOWS_PROCESS.OBJ|D:\PROJECTS\VISUALSTUDIO\TCP_CLIENT\TCP_CLIENT\DEBUG\WINDOWS_SOCKET.OBJ
D:\PROJECTS\VISUALSTUDIO\TCP_CLIENT\DEBUG\TCP_CLIENT.EXE
D:\PROJECTS\VISUALSTUDIO\TCP_CLIENT\DEBUG\TCP_CLIENT.ILK
D:\PROJECTS\VISUALSTUDIO\TCP_CLIENT\DEBUG\TCP_CLIENT.PDB
