^D:\PROJECTS\VISUALSTUDIO\TCP_SERVER\TCP_SERVER\DEBUG\LINUX_SOCKET.OBJ|D:\PROJECTS\VISUALSTUDIO\TCP_SERVER\TCP_SERVER\DEBUG\MAIN_SERVER.OBJ|D:\PROJECTS\VISUALSTUDIO\TCP_SERVER\TCP_SERVER\DEBUG\WINDOWS_SOCKET.OBJ
/OUT:"D:\PROJECTS\VISUALSTUDIO\TCP_SERVER\DEBUG\TCP_SERVER.EXE" /INCREMENTAL /NOLOGO KERNEL32.LIB USER32.LIB GDI32.LIB WINSPOOL.LIB COMDLG32.LIB ADVAPI32.LIB SHELL32.LIB OLE32.LIB OLEAUT32.LIB UUID.LIB ODBC32.LIB ODBCCP32.LIB /MANIFEST /MANIFESTUAC:"level='asInvoker' uiAccess='false'" /manifest:embed /DEBUG:FASTLINK /PDB:"D:\PROJECTS\VISUALSTUDIO\TCP_SERVER\DEBUG\TCP_SERVER.PDB" /SUBSYSTEM:CONSOLE /TLBID:1 /DYNAMICBASE /NXCOMPAT /IMPLIB:"D:\PROJECTS\VISUALSTUDIO\TCP_SERVER\DEBUG\TCP_SERVER.LIB" /MACHINE:X86 DEBUG\LINUX_SOCKET.OBJ
DEBUG\MAIN_SERVER.OBJ
DEBUG\WINDOWS_SOCKET.OBJ
