^D:\PROJECTS\VISUALSTUDIO\TCP_CLIENT\TCP_CLIENT\LINUX_SOCKET.C|D:\PROJECTS\VISUALSTUDIO\TCP_CLIENT\TCP_CLIENT\MAIN_CLIENT.C|D:\PROJECTS\VISUALSTUDIO\TCP_CLIENT\TCP_CLIENT\WINDOWS_SOCKET.C
D:\PROJECTS\VISUALSTUDIO\TCP_CLIENT\TCP_CLIENT\DEBUG\VC142.PDB
D:\PROJECTS\VISUALSTUDIO\TCP_CLIENT\TCP_CLIENT\DEBUG\VC142.IDB
D:\PROJECTS\VISUALSTUDIO\TCP_CLIENT\TCP_CLIENT\DEBUG\WINDOWS_SOCKET.OBJ
D:\PROJECTS\VISUALSTUDIO\TCP_CLIENT\TCP_CLIENT\DEBUG\MAIN_CLIENT.OBJ
D:\PROJECTS\VISUALSTUDIO\TCP_CLIENT\TCP_CLIENT\DEBUG\LINUX_SOCKET.OBJ
^D:\PROJECTS\VISUALSTUDIO\TCP_CLIENT\TCP_CLIENT\LINUX_PROCESS.C|D:\PROJECTS\VISUALSTUDIO\TCP_CLIENT\TCP_CLIENT\MAIN_CLIENT.C|D:\PROJECTS\VISUALSTUDIO\TCP_CLIENT\TCP_CLIENT\WINDOWS_PROCESS.C
D:\PROJECTS\VISUALSTUDIO\TCP_CLIENT\TCP_CLIENT\DEBUG\VC142.PDB
D:\PROJECTS\VISUALSTUDIO\TCP_CLIENT\TCP_CLIENT\DEBUG\VC142.IDB
D:\PROJECTS\VISUALSTUDIO\TCP_CLIENT\TCP_CLIENT\DEBUG\WINDOWS_PROCESS.OBJ
D:\PROJECTS\VISUALSTUDIO\TCP_CLIENT\TCP_CLIENT\DEBUG\MAIN_CLIENT.OBJ
D:\PROJECTS\VISUALSTUDIO\TCP_CLIENT\TCP_CLIENT\DEBUG\LINUX_PROCESS.OBJ
^D:\PROJECTS\VISUALSTUDIO\TCP_CLIENT\TCP_CLIENT\WINDOWS_PROCESS.C|D:\PROJECTS\VISUALSTUDIO\TCP_CLIENT\TCP_CLIENT\WINDOWS_SOCKET.C
D:\PROJECTS\VISUALSTUDIO\TCP_CLIENT\TCP_CLIENT\DEBUG\VC142.PDB
D:\PROJECTS\VISUALSTUDIO\TCP_CLIENT\TCP_CLIENT\DEBUG\VC142.IDB
D:\PROJECTS\VISUALSTUDIO\TCP_CLIENT\TCP_CLIENT\DEBUG\WINDOWS_SOCKET.OBJ
D:\PROJECTS\VISUALSTUDIO\TCP_CLIENT\TCP_CLIENT\DEBUG\WINDOWS_PROCESS.OBJ
^D:\PROJECTS\VISUALSTUDIO\TCP_CLIENT\TCP_CLIENT\MAIN_CLIENT.C|D:\PROJECTS\VISUALSTUDIO\TCP_CLIENT\TCP_CLIENT\WINDOWS_PROCESS.C
D:\PROJECTS\VISUALSTUDIO\TCP_CLIENT\TCP_CLIENT\DEBUG\VC142.PDB
D:\PROJECTS\VISUALSTUDIO\TCP_CLIENT\TCP_CLIENT\DEBUG\VC142.IDB
D:\PROJECTS\VISUALSTUDIO\TCP_CLIENT\TCP_CLIENT\DEBUG\WINDOWS_PROCESS.OBJ
D:\PROJECTS\VISUALSTUDIO\TCP_CLIENT\TCP_CLIENT\DEBUG\MAIN_CLIENT.OBJ
^D:\PROJECTS\VISUALSTUDIO\TCP_CLIENT\TCP_CLIENT\LINUX_PROCESS.C|D:\PROJECTS\VISUALSTUDIO\TCP_CLIENT\TCP_CLIENT\LINUX_SOCKET.C|D:\PROJECTS\VISUALSTUDIO\TCP_CLIENT\TCP_CLIENT\MAIN_CLIENT.C|D:\PROJECTS\VISUALSTUDIO\TCP_CLIENT\TCP_CLIENT\WINDOWS_PROCESS.C|D:\PROJECTS\VISUALSTUDIO\TCP_CLIENT\TCP_CLIENT\WINDOWS_SOCKET.C
D:\PROJECTS\VISUALSTUDIO\TCP_CLIENT\TCP_CLIENT\DEBUG\VC142.PDB
D:\PROJECTS\VISUALSTUDIO\TCP_CLIENT\TCP_CLIENT\DEBUG\VC142.IDB
D:\PROJECTS\VISUALSTUDIO\TCP_CLIENT\TCP_CLIENT\DEBUG\WINDOWS_PROCESS.OBJ
D:\PROJECTS\VISUALSTUDIO\TCP_CLIENT\TCP_CLIENT\DEBUG\LINUX_PROCESS.OBJ
^D:\PROJECTS\VISUALSTUDIO\TCP_CLIENT\TCP_CLIENT\LINUX_PROCESS.C
D:\PROJECTS\VISUALSTUDIO\TCP_CLIENT\TCP_CLIENT\DEBUG\LINUX_PROCESS.OBJ
^D:\PROJECTS\VISUALSTUDIO\TCP_CLIENT\TCP_CLIENT\LINUX_SOCKET.C|D:\PROJECTS\VISUALSTUDIO\TCP_CLIENT\TCP_CLIENT\MAIN_CLIENT.C|D:\PROJECTS\VISUALSTUDIO\TCP_CLIENT\TCP_CLIENT\WINDOWS_PROCESS.C|D:\PROJECTS\VISUALSTUDIO\TCP_CLIENT\TCP_CLIENT\WINDOWS_SOCKET.C
D:\PROJECTS\VISUALSTUDIO\TCP_CLIENT\TCP_CLIENT\DEBUG\VC142.PDB
D:\PROJECTS\VISUALSTUDIO\TCP_CLIENT\TCP_CLIENT\DEBUG\VC142.IDB
D:\PROJECTS\VISUALSTUDIO\TCP_CLIENT\TCP_CLIENT\DEBUG\WINDOWS_SOCKET.OBJ
D:\PROJECTS\VISUALSTUDIO\TCP_CLIENT\TCP_CLIENT\DEBUG\WINDOWS_PROCESS.OBJ
D:\PROJECTS\VISUALSTUDIO\TCP_CLIENT\TCP_CLIENT\DEBUG\LINUX_SOCKET.OBJ
^D:\PROJECTS\VISUALSTUDIO\TCP_CLIENT\TCP_CLIENT\LINUX_SOCKET.C
D:\PROJECTS\VISUALSTUDIO\TCP_CLIENT\TCP_CLIENT\DEBUG\LINUX_SOCKET.OBJ
^D:\PROJECTS\VISUALSTUDIO\TCP_CLIENT\TCP_CLIENT\MAIN_CLIENT.C|D:\PROJECTS\VISUALSTUDIO\TCP_CLIENT\TCP_CLIENT\WINDOWS_PROCESS.C|D:\PROJECTS\VISUALSTUDIO\TCP_CLIENT\TCP_CLIENT\WINDOWS_SOCKET.C
D:\PROJECTS\VISUALSTUDIO\TCP_CLIENT\TCP_CLIENT\DEBUG\VC142.PDB
D:\PROJECTS\VISUALSTUDIO\TCP_CLIENT\TCP_CLIENT\DEBUG\VC142.IDB
D:\PROJECTS\VISUALSTUDIO\TCP_CLIENT\TCP_CLIENT\DEBUG\WINDOWS_SOCKET.OBJ
D:\PROJECTS\VISUALSTUDIO\TCP_CLIENT\TCP_CLIENT\DEBUG\WINDOWS_PROCESS.OBJ
D:\PROJECTS\VISUALSTUDIO\TCP_CLIENT\TCP_CLIENT\DEBUG\MAIN_CLIENT.OBJ
^D:\PROJECTS\VISUALSTUDIO\TCP_CLIENT\TCP_CLIENT\WINDOWS_SOCKET.C
D:\PROJECTS\VISUALSTUDIO\TCP_CLIENT\TCP_CLIENT\DEBUG\VC142.PDB
^D:\PROJECTS\VISUALSTUDIO\TCP_CLIENT\TCP_CLIENT\MAIN_CLIENT.C
D:\PROJECTS\VISUALSTUDIO\TCP_CLIENT\TCP_CLIENT\DEBUG\VC142.PDB
D:\PROJECTS\VISUALSTUDIO\TCP_CLIENT\TCP_CLIENT\DEBUG\VC142.IDB
D:\PROJECTS\VISUALSTUDIO\TCP_CLIENT\TCP_CLIENT\DEBUG\MAIN_CLIENT.OBJ
^D:\PROJECTS\VISUALSTUDIO\TCP_CLIENT\TCP_CLIENT\WINDOWS_PROCESS.C
D:\PROJECTS\VISUALSTUDIO\TCP_CLIENT\TCP_CLIENT\DEBUG\VC142.PDB
D:\PROJECTS\VISUALSTUDIO\TCP_CLIENT\TCP_CLIENT\DEBUG\VC142.IDB
D:\PROJECTS\VISUALSTUDIO\TCP_CLIENT\TCP_CLIENT\DEBUG\WINDOWS_PROCESS.OBJ
