{
  "flex-layout.row#footer-mobile": {
    "children": ["flex-layout.col#footer-mobile"]
  },
  "flex-layout.col#footer-mobile": {
    "props": {
      // "horizontalAlign": "",
      "rowGap": 4
    },
    "children": [
      "flex-layout.row#footer-links-mobile",
      "flex-layout.row#footer-social-media-mobile"
    ]
  }
}
