{
  "flex-layout.row#footer-location": {
    "props": {
      "preserveLayoutOnMobile": true,
      "colGap": 4,
      "preventHorizontalStretch": true
    },
    "children": ["image#location", "rich-text#location"]
  },
  "image#location": {
    "props": {
      "maxWidth": "25px",
      "blockClass": "footer-location",
      "src": "assets/icons/location.svg"
    }
  },
  "rich-text#location": {
    "props": {
      "blockClass": "footer-location",
      "text": "United States"
    }
  },
  "rich-text#footer-rights": {
    "props": {
      "blockClass": "footer-rights",
      "text": "© 2021 | Cora Leviene All Rights Reserved"
    }
  }
}
