{
  "flex-layout.row#footer-links": {
    "children": [
      "flex-layout.col#footer-col-1",
      "flex-layout.col#footer-col-2",
      "flex-layout.col#footer-col-3"
    ]
  },

  "flex-layout.col#footer-col-1": {
    "children": [
      "rich-text#footer-menu-title-1",
      "vtex.menu@2.x:menu#footer-menu-col-1"
    ]
  },
  "flex-layout.col#footer-col-2": {
    "children": [
      "rich-text#footer-menu-title-2",
      "vtex.menu@2.x:menu#footer-menu-col-2"
    ]
  },
  "flex-layout.col#footer-col-3": {
    "children": [
      "rich-text#footer-menu-title-3",
      "vtex.menu@2.x:menu#footer-menu-col-3"
    ]
  },
  "vtex.menu@2.x:menu#footer-menu-col-1": {
    "title": "Footer menu col 1",
    "props": {
      "orientation": "vertical",
      "blockClass": ["footer-menu", "footer-col"]
    },
    "children": [
      "menu-item#skincare",
      "menu-item#handbags",
      "menu-item#watches"
    ]
  },
  "rich-text#footer-menu-title-1": {
    "props": {
      "text": "#### Categorii",
      "blockClass": "footer-menu-title"
    }
  },
  "vtex.menu@2.x:menu#footer-menu-col-2": {
    "title": "Footer menu col 2",
    "props": {
      "orientation": "horizontal",
      "blockClass": ["footer-menu", "footer-row"]
    },
    "children": [
      // "rich-text#footer-menu-title-2",
      // "flex-layout.row#footer-row-2"
      "menu-item#contact-us",
      "menu-item#about-us",
      "menu-item#careers",
      "menu-item#press"
    ]
  },

  "rich-text#footer-menu-title-2": {
    "props": {
      "text": "#### About",
      "blockClass": ["footer-menu-title"]
    }
  },
  "vtex.menu@2.x:menu#footer-menu-col-3": {
    "title": "Footer menu col 3",
    "props": {
      "orientation": "horizontal",
      "blockClass": ["footer-menu", "footer-row"]
    },
    "children": [
      // "rich-text#footer-menu-title-3",
      "menu-item#rp",
      "menu-item#tou",
      "menu-item#sitemap",
      "menu-item#security",
      "menu-item#privacy",
      "menu-item#compliance"
    ]
  },
  "rich-text#footer-menu-title-3": {
    "props": {
      "text": "#### Policy",
      "blockClass": ["footer-menu-title"]
    }
  }
}
