{
  "search-bar#header": {
    "props": {
      "displayMode": "search-button",
      "placeholder": "Search for products or brands.....",
      "emptyPlaceholder": "No result for",
      "containerMode": "overlay"
    }
  }
}
