-- Merging decision tree log ---
provider#nl.xservices.plugins.FileProvider
INJECTED from C:\Users\sergi\ionic\aurus_electoral_play-uuid\platforms\android\app\src\main\AndroidManifest.xml:17:9-19:20
	android:grantUriPermissions
		ADDED from C:\Users\sergi\ionic\aurus_electoral_play-uuid\platforms\android\app\src\main\AndroidManifest.xml:17:100-134
	android:authorities
		INJECTED from C:\Users\sergi\ionic\aurus_electoral_play-uuid\platforms\android\app\src\main\AndroidManifest.xml
		ADDED from C:\Users\sergi\ionic\aurus_electoral_play-uuid\platforms\android\app\src\main\AndroidManifest.xml:17:19-74
	android:exported
		ADDED from C:\Users\sergi\ionic\aurus_electoral_play-uuid\platforms\android\app\src\main\AndroidManifest.xml:17:75-99
	android:name
		ADDED from C:\Users\sergi\ionic\aurus_electoral_play-uuid\platforms\android\app\src\main\AndroidManifest.xml:17:135-183
manifest
ADDED from C:\Users\sergi\ionic\aurus_electoral_play-uuid\platforms\android\app\src\main\AndroidManifest.xml:2:1-27:12
INJECTED from C:\Users\sergi\ionic\aurus_electoral_play-uuid\platforms\android\app\src\main\AndroidManifest.xml:2:1-27:12
INJECTED from C:\Users\sergi\ionic\aurus_electoral_play-uuid\platforms\android\app\src\main\AndroidManifest.xml:2:1-27:12
INJECTED from C:\Users\sergi\ionic\aurus_electoral_play-uuid\platforms\android\app\src\main\AndroidManifest.xml:2:1-27:12
MERGED from [:CordovaLib] C:\Users\sergi\ionic\aurus_electoral_play-uuid\platforms\android\CordovaLib\build\intermediates\library_manifest\debug\AndroidManifest.xml:20:1-27:12
MERGED from [androidx.legacy:legacy-support-v4:1.0.0] C:\Users\sergi\.gradle\caches\transforms-1\files-1.1\legacy-support-v4-1.0.0.aar\e1fc7f15999f67cd65485f0a353b7329\AndroidManifest.xml:17:1-22:12
MERGED from [androidx.media:media:1.0.0] C:\Users\sergi\.gradle\caches\transforms-1\files-1.1\media-1.0.0.aar\7a7cc6757eeb714bc29f80bb6737616f\AndroidManifest.xml:17:1-22:12
MERGED from [androidx.fragment:fragment:1.0.0] C:\Users\sergi\.gradle\caches\transforms-1\files-1.1\fragment-1.0.0.aar\1654c9e05451cba6e0e6a3c6db554a2a\AndroidManifest.xml:17:1-22:12
MERGED from [androidx.legacy:legacy-support-core-ui:1.0.0] C:\Users\sergi\.gradle\caches\transforms-1\files-1.1\legacy-support-core-ui-1.0.0.aar\6d7df59ea1e7066984e744c35c669247\AndroidManifest.xml:17:1-22:12
MERGED from [androidx.legacy:legacy-support-core-utils:1.0.0] C:\Users\sergi\.gradle\caches\transforms-1\files-1.1\legacy-support-core-utils-1.0.0.aar\abf3723886f7881e8de8fe5cecbac099\AndroidManifest.xml:17:1-22:12
MERGED from [androidx.loader:loader:1.0.0] C:\Users\sergi\.gradle\caches\transforms-1\files-1.1\loader-1.0.0.aar\4facc5caf65a060a2cfc0b5e3615f13c\AndroidManifest.xml:17:1-22:12
MERGED from [androidx.viewpager:viewpager:1.0.0] C:\Users\sergi\.gradle\caches\transforms-1\files-1.1\viewpager-1.0.0.aar\352496ca226bb4e10f3aa5fe329b7d47\AndroidManifest.xml:17:1-22:12
MERGED from [androidx.coordinatorlayout:coordinatorlayout:1.0.0] C:\Users\sergi\.gradle\caches\transforms-1\files-1.1\coordinatorlayout-1.0.0.aar\2038a5975c34f1e0ebaaf69b92bb484c\AndroidManifest.xml:17:1-22:12
MERGED from [androidx.drawerlayout:drawerlayout:1.0.0] C:\Users\sergi\.gradle\caches\transforms-1\files-1.1\drawerlayout-1.0.0.aar\3c6ede4a4125a77f0d45751fc555f58a\AndroidManifest.xml:17:1-22:12
MERGED from [androidx.slidingpanelayout:slidingpanelayout:1.0.0] C:\Users\sergi\.gradle\caches\transforms-1\files-1.1\slidingpanelayout-1.0.0.aar\877ed850a4e30c49e81f0933ebd7e29e\AndroidManifest.xml:17:1-22:12
MERGED from [androidx.customview:customview:1.0.0] C:\Users\sergi\.gradle\caches\transforms-1\files-1.1\customview-1.0.0.aar\b2278abf1db82b42ca7cc6278b236e71\AndroidManifest.xml:17:1-22:12
MERGED from [androidx.swiperefreshlayout:swiperefreshlayout:1.0.0] C:\Users\sergi\.gradle\caches\transforms-1\files-1.1\swiperefreshlayout-1.0.0.aar\51d165456f36053c5886f27e0f65783b\AndroidManifest.xml:17:1-22:12
MERGED from [androidx.asynclayoutinflater:asynclayoutinflater:1.0.0] C:\Users\sergi\.gradle\caches\transforms-1\files-1.1\asynclayoutinflater-1.0.0.aar\a826cc2e794f8e72c2eb28417ec2e435\AndroidManifest.xml:17:1-22:12
MERGED from [androidx.core:core:1.0.0] C:\Users\sergi\.gradle\caches\transforms-1\files-1.1\core-1.0.0.aar\7fd24d2c592542aadd89b594e00d3072\AndroidManifest.xml:17:1-24:12
MERGED from [androidx.versionedparcelable:versionedparcelable:1.0.0] C:\Users\sergi\.gradle\caches\transforms-1\files-1.1\versionedparcelable-1.0.0.aar\fcfaeee214f8bf90c82676ac32cffd18\AndroidManifest.xml:17:1-25:12
MERGED from [androidx.lifecycle:lifecycle-runtime:2.0.0] C:\Users\sergi\.gradle\caches\transforms-1\files-1.1\lifecycle-runtime-2.0.0.aar\16078c521e703f0ac06572361765a1ef\AndroidManifest.xml:17:1-22:12
MERGED from [androidx.documentfile:documentfile:1.0.0] C:\Users\sergi\.gradle\caches\transforms-1\files-1.1\documentfile-1.0.0.aar\e458c5fdf9f6f11409513809c1c315fc\AndroidManifest.xml:17:1-22:12
MERGED from [androidx.localbroadcastmanager:localbroadcastmanager:1.0.0] C:\Users\sergi\.gradle\caches\transforms-1\files-1.1\localbroadcastmanager-1.0.0.aar\ca6d2926ee6a16bd087cda9f949b8353\AndroidManifest.xml:17:1-22:12
MERGED from [androidx.print:print:1.0.0] C:\Users\sergi\.gradle\caches\transforms-1\files-1.1\print-1.0.0.aar\f5195e49519f24105aff9d75f907389b\AndroidManifest.xml:17:1-22:12
MERGED from [androidx.interpolator:interpolator:1.0.0] C:\Users\sergi\.gradle\caches\transforms-1\files-1.1\interpolator-1.0.0.aar\667eb5d90710bdfae5126dadda0cc43d\AndroidManifest.xml:17:1-22:12
MERGED from [androidx.cursoradapter:cursoradapter:1.0.0] C:\Users\sergi\.gradle\caches\transforms-1\files-1.1\cursoradapter-1.0.0.aar\1a46d9cfa1ae9d51a612dcc5d375f56a\AndroidManifest.xml:17:1-22:12
MERGED from [androidx.lifecycle:lifecycle-viewmodel:2.0.0] C:\Users\sergi\.gradle\caches\transforms-1\files-1.1\lifecycle-viewmodel-2.0.0.aar\9ce9490dca2bb54959586f4e291c5fbf\AndroidManifest.xml:17:1-22:12
MERGED from [androidx.lifecycle:lifecycle-livedata:2.0.0] C:\Users\sergi\.gradle\caches\transforms-1\files-1.1\lifecycle-livedata-2.0.0.aar\88ce7a0251e085e9f5e34645dc291b0c\AndroidManifest.xml:17:1-22:12
MERGED from [androidx.lifecycle:lifecycle-livedata-core:2.0.0] C:\Users\sergi\.gradle\caches\transforms-1\files-1.1\lifecycle-livedata-core-2.0.0.aar\dacc0eb2f371000ee9be366ca9cd52ed\AndroidManifest.xml:17:1-22:12
MERGED from [androidx.arch.core:core-runtime:2.0.0] C:\Users\sergi\.gradle\caches\transforms-1\files-1.1\core-runtime-2.0.0.aar\d2877b80342ca6ede9479c08ea9d6cad\AndroidManifest.xml:17:1-22:12
INJECTED from C:\Users\sergi\ionic\aurus_electoral_play-uuid\platforms\android\app\src\main\AndroidManifest.xml:2:1-27:12
INJECTED from C:\Users\sergi\ionic\aurus_electoral_play-uuid\platforms\android\app\src\main\AndroidManifest.xml:2:1-27:12
INJECTED from C:\Users\sergi\ionic\aurus_electoral_play-uuid\platforms\android\app\src\main\AndroidManifest.xml:2:1-27:12
	package
		ADDED from C:\Users\sergi\ionic\aurus_electoral_play-uuid\platforms\android\app\src\main\AndroidManifest.xml:2:98-126
		INJECTED from C:\Users\sergi\ionic\aurus_electoral_play-uuid\platforms\android\app\src\main\AndroidManifest.xml
		INJECTED from C:\Users\sergi\ionic\aurus_electoral_play-uuid\platforms\android\app\src\main\AndroidManifest.xml
	android:versionName
		ADDED from C:\Users\sergi\ionic\aurus_electoral_play-uuid\platforms\android\app\src\main\AndroidManifest.xml:2:70-97
		INJECTED from C:\Users\sergi\ionic\aurus_electoral_play-uuid\platforms\android\app\src\main\AndroidManifest.xml
		INJECTED from C:\Users\sergi\ionic\aurus_electoral_play-uuid\platforms\android\app\src\main\AndroidManifest.xml
	android:hardwareAccelerated
		ADDED from C:\Users\sergi\ionic\aurus_electoral_play-uuid\platforms\android\app\src\main\AndroidManifest.xml:2:11-45
	xmlns:android
		ADDED from C:\Users\sergi\ionic\aurus_electoral_play-uuid\platforms\android\app\src\main\AndroidManifest.xml:2:127-185
	android:versionCode
		ADDED from C:\Users\sergi\ionic\aurus_electoral_play-uuid\platforms\android\app\src\main\AndroidManifest.xml:2:46-69
		INJECTED from C:\Users\sergi\ionic\aurus_electoral_play-uuid\platforms\android\app\src\main\AndroidManifest.xml
		INJECTED from C:\Users\sergi\ionic\aurus_electoral_play-uuid\platforms\android\app\src\main\AndroidManifest.xml
supports-screens
ADDED from C:\Users\sergi\ionic\aurus_electoral_play-uuid\platforms\android\app\src\main\AndroidManifest.xml:3:5-191
	android:largeScreens
		ADDED from C:\Users\sergi\ionic\aurus_electoral_play-uuid\platforms\android\app\src\main\AndroidManifest.xml:3:49-76
	android:smallScreens
		ADDED from C:\Users\sergi\ionic\aurus_electoral_play-uuid\platforms\android\app\src\main\AndroidManifest.xml:3:132-159
	android:normalScreens
		ADDED from C:\Users\sergi\ionic\aurus_electoral_play-uuid\platforms\android\app\src\main\AndroidManifest.xml:3:77-105
	android:xlargeScreens
		ADDED from C:\Users\sergi\ionic\aurus_electoral_play-uuid\platforms\android\app\src\main\AndroidManifest.xml:3:160-188
	android:resizeable
		ADDED from C:\Users\sergi\ionic\aurus_electoral_play-uuid\platforms\android\app\src\main\AndroidManifest.xml:3:106-131
	android:anyDensity
		ADDED from C:\Users\sergi\ionic\aurus_electoral_play-uuid\platforms\android\app\src\main\AndroidManifest.xml:3:23-48
uses-permission#android.permission.INTERNET
ADDED from C:\Users\sergi\ionic\aurus_electoral_play-uuid\platforms\android\app\src\main\AndroidManifest.xml:4:5-67
	android:name
		ADDED from C:\Users\sergi\ionic\aurus_electoral_play-uuid\platforms\android\app\src\main\AndroidManifest.xml:4:22-64
application
ADDED from C:\Users\sergi\ionic\aurus_electoral_play-uuid\platforms\android\app\src\main\AndroidManifest.xml:5:5-20:19
MERGED from [androidx.core:core:1.0.0] C:\Users\sergi\.gradle\caches\transforms-1\files-1.1\core-1.0.0.aar\7fd24d2c592542aadd89b594e00d3072\AndroidManifest.xml:22:5-89
MERGED from [androidx.core:core:1.0.0] C:\Users\sergi\.gradle\caches\transforms-1\files-1.1\core-1.0.0.aar\7fd24d2c592542aadd89b594e00d3072\AndroidManifest.xml:22:5-89
MERGED from [androidx.versionedparcelable:versionedparcelable:1.0.0] C:\Users\sergi\.gradle\caches\transforms-1\files-1.1\versionedparcelable-1.0.0.aar\fcfaeee214f8bf90c82676ac32cffd18\AndroidManifest.xml:22:5-23:19
MERGED from [androidx.versionedparcelable:versionedparcelable:1.0.0] C:\Users\sergi\.gradle\caches\transforms-1\files-1.1\versionedparcelable-1.0.0.aar\fcfaeee214f8bf90c82676ac32cffd18\AndroidManifest.xml:22:5-23:19
	android:appComponentFactory
		ADDED from [androidx.core:core:1.0.0] C:\Users\sergi\.gradle\caches\transforms-1\files-1.1\core-1.0.0.aar\7fd24d2c592542aadd89b594e00d3072\AndroidManifest.xml:22:18-86
	android:supportsRtl
		ADDED from C:\Users\sergi\ionic\aurus_electoral_play-uuid\platforms\android\app\src\main\AndroidManifest.xml:5:182-208
	android:label
		ADDED from C:\Users\sergi\ionic\aurus_electoral_play-uuid\platforms\android\app\src\main\AndroidManifest.xml:5:88-120
	android:hardwareAccelerated
		ADDED from C:\Users\sergi\ionic\aurus_electoral_play-uuid\platforms\android\app\src\main\AndroidManifest.xml:5:18-52
	android:icon
		ADDED from C:\Users\sergi\ionic\aurus_electoral_play-uuid\platforms\android\app\src\main\AndroidManifest.xml:5:53-87
	android:networkSecurityConfig
		ADDED from C:\Users\sergi\ionic\aurus_electoral_play-uuid\platforms\android\app\src\main\AndroidManifest.xml:5:121-181
activity#io.ionic.auruselec.MainActivity
ADDED from C:\Users\sergi\ionic\aurus_electoral_play-uuid\platforms\android\app\src\main\AndroidManifest.xml:6:9-11:20
	android:label
		ADDED from C:\Users\sergi\ionic\aurus_electoral_play-uuid\platforms\android\app\src\main\AndroidManifest.xml:6:136-173
	android:launchMode
		ADDED from C:\Users\sergi\ionic\aurus_electoral_play-uuid\platforms\android\app\src\main\AndroidManifest.xml:6:174-204
	android:windowSoftInputMode
		ADDED from C:\Users\sergi\ionic\aurus_electoral_play-uuid\platforms\android\app\src\main\AndroidManifest.xml:6:296-338
	android:configChanges
		ADDED from C:\Users\sergi\ionic\aurus_electoral_play-uuid\platforms\android\app\src\main\AndroidManifest.xml:6:19-135
	android:theme
		ADDED from C:\Users\sergi\ionic\aurus_electoral_play-uuid\platforms\android\app\src\main\AndroidManifest.xml:6:233-295
	android:name
		ADDED from C:\Users\sergi\ionic\aurus_electoral_play-uuid\platforms\android\app\src\main\AndroidManifest.xml:6:205-232
intent-filter#action:name:android.intent.action.MAIN+category:name:android.intent.category.LAUNCHER
ADDED from C:\Users\sergi\ionic\aurus_electoral_play-uuid\platforms\android\app\src\main\AndroidManifest.xml:7:13-10:29
	android:label
		ADDED from C:\Users\sergi\ionic\aurus_electoral_play-uuid\platforms\android\app\src\main\AndroidManifest.xml:7:28-65
action#android.intent.action.MAIN
ADDED from C:\Users\sergi\ionic\aurus_electoral_play-uuid\platforms\android\app\src\main\AndroidManifest.xml:8:17-69
	android:name
		ADDED from C:\Users\sergi\ionic\aurus_electoral_play-uuid\platforms\android\app\src\main\AndroidManifest.xml:8:25-66
category#android.intent.category.LAUNCHER
ADDED from C:\Users\sergi\ionic\aurus_electoral_play-uuid\platforms\android\app\src\main\AndroidManifest.xml:9:17-77
	android:name
		ADDED from C:\Users\sergi\ionic\aurus_electoral_play-uuid\platforms\android\app\src\main\AndroidManifest.xml:9:27-74
receiver#nl.xservices.plugins.ShareChooserPendingIntent
ADDED from C:\Users\sergi\ionic\aurus_electoral_play-uuid\platforms\android\app\src\main\AndroidManifest.xml:12:9-16:20
	android:enabled
		ADDED from C:\Users\sergi\ionic\aurus_electoral_play-uuid\platforms\android\app\src\main\AndroidManifest.xml:12:19-41
	android:name
		ADDED from C:\Users\sergi\ionic\aurus_electoral_play-uuid\platforms\android\app\src\main\AndroidManifest.xml:12:42-103
intent-filter#action:name:android.intent.action.SEND
ADDED from C:\Users\sergi\ionic\aurus_electoral_play-uuid\platforms\android\app\src\main\AndroidManifest.xml:13:13-15:29
action#android.intent.action.SEND
ADDED from C:\Users\sergi\ionic\aurus_electoral_play-uuid\platforms\android\app\src\main\AndroidManifest.xml:14:17-69
	android:name
		ADDED from C:\Users\sergi\ionic\aurus_electoral_play-uuid\platforms\android\app\src\main\AndroidManifest.xml:14:25-66
uses-permission#android.permission.CALL_PHONE
ADDED from C:\Users\sergi\ionic\aurus_electoral_play-uuid\platforms\android\app\src\main\AndroidManifest.xml:21:5-69
	android:name
		ADDED from C:\Users\sergi\ionic\aurus_electoral_play-uuid\platforms\android\app\src\main\AndroidManifest.xml:21:22-66
uses-feature#android.hardware.telephony
ADDED from C:\Users\sergi\ionic\aurus_electoral_play-uuid\platforms\android\app\src\main\AndroidManifest.xml:22:5-88
	android:required
		ADDED from C:\Users\sergi\ionic\aurus_electoral_play-uuid\platforms\android\app\src\main\AndroidManifest.xml:22:61-85
	android:name
		ADDED from C:\Users\sergi\ionic\aurus_electoral_play-uuid\platforms\android\app\src\main\AndroidManifest.xml:22:19-60
uses-permission#android.permission.READ_CALENDAR
ADDED from C:\Users\sergi\ionic\aurus_electoral_play-uuid\platforms\android\app\src\main\AndroidManifest.xml:23:5-72
	android:name
		ADDED from C:\Users\sergi\ionic\aurus_electoral_play-uuid\platforms\android\app\src\main\AndroidManifest.xml:23:22-69
uses-permission#android.permission.WRITE_CALENDAR
ADDED from C:\Users\sergi\ionic\aurus_electoral_play-uuid\platforms\android\app\src\main\AndroidManifest.xml:24:5-73
	android:name
		ADDED from C:\Users\sergi\ionic\aurus_electoral_play-uuid\platforms\android\app\src\main\AndroidManifest.xml:24:22-70
uses-permission#android.permission.READ_PHONE_STATE
ADDED from C:\Users\sergi\ionic\aurus_electoral_play-uuid\platforms\android\app\src\main\AndroidManifest.xml:25:5-75
	android:name
		ADDED from C:\Users\sergi\ionic\aurus_electoral_play-uuid\platforms\android\app\src\main\AndroidManifest.xml:25:22-72
uses-permission#android.permission.WRITE_EXTERNAL_STORAGE
ADDED from C:\Users\sergi\ionic\aurus_electoral_play-uuid\platforms\android\app\src\main\AndroidManifest.xml:26:5-81
	android:name
		ADDED from C:\Users\sergi\ionic\aurus_electoral_play-uuid\platforms\android\app\src\main\AndroidManifest.xml:26:22-78
uses-sdk
INJECTED from C:\Users\sergi\ionic\aurus_electoral_play-uuid\platforms\android\app\src\main\AndroidManifest.xml reason: use-sdk injection requested
INJECTED from C:\Users\sergi\ionic\aurus_electoral_play-uuid\platforms\android\app\src\main\AndroidManifest.xml
INJECTED from C:\Users\sergi\ionic\aurus_electoral_play-uuid\platforms\android\app\src\main\AndroidManifest.xml
MERGED from [:CordovaLib] C:\Users\sergi\ionic\aurus_electoral_play-uuid\platforms\android\CordovaLib\build\intermediates\library_manifest\debug\AndroidManifest.xml:25:5-44
MERGED from [:CordovaLib] C:\Users\sergi\ionic\aurus_electoral_play-uuid\platforms\android\CordovaLib\build\intermediates\library_manifest\debug\AndroidManifest.xml:25:5-44
MERGED from [androidx.legacy:legacy-support-v4:1.0.0] C:\Users\sergi\.gradle\caches\transforms-1\files-1.1\legacy-support-v4-1.0.0.aar\e1fc7f15999f67cd65485f0a353b7329\AndroidManifest.xml:20:5-44
MERGED from [androidx.legacy:legacy-support-v4:1.0.0] C:\Users\sergi\.gradle\caches\transforms-1\files-1.1\legacy-support-v4-1.0.0.aar\e1fc7f15999f67cd65485f0a353b7329\AndroidManifest.xml:20:5-44
MERGED from [androidx.media:media:1.0.0] C:\Users\sergi\.gradle\caches\transforms-1\files-1.1\media-1.0.0.aar\7a7cc6757eeb714bc29f80bb6737616f\AndroidManifest.xml:20:5-44
MERGED from [androidx.media:media:1.0.0] C:\Users\sergi\.gradle\caches\transforms-1\files-1.1\media-1.0.0.aar\7a7cc6757eeb714bc29f80bb6737616f\AndroidManifest.xml:20:5-44
MERGED from [androidx.fragment:fragment:1.0.0] C:\Users\sergi\.gradle\caches\transforms-1\files-1.1\fragment-1.0.0.aar\1654c9e05451cba6e0e6a3c6db554a2a\AndroidManifest.xml:20:5-44
MERGED from [androidx.fragment:fragment:1.0.0] C:\Users\sergi\.gradle\caches\transforms-1\files-1.1\fragment-1.0.0.aar\1654c9e05451cba6e0e6a3c6db554a2a\AndroidManifest.xml:20:5-44
MERGED from [androidx.legacy:legacy-support-core-ui:1.0.0] C:\Users\sergi\.gradle\caches\transforms-1\files-1.1\legacy-support-core-ui-1.0.0.aar\6d7df59ea1e7066984e744c35c669247\AndroidManifest.xml:20:5-44
MERGED from [androidx.legacy:legacy-support-core-ui:1.0.0] C:\Users\sergi\.gradle\caches\transforms-1\files-1.1\legacy-support-core-ui-1.0.0.aar\6d7df59ea1e7066984e744c35c669247\AndroidManifest.xml:20:5-44
MERGED from [androidx.legacy:legacy-support-core-utils:1.0.0] C:\Users\sergi\.gradle\caches\transforms-1\files-1.1\legacy-support-core-utils-1.0.0.aar\abf3723886f7881e8de8fe5cecbac099\AndroidManifest.xml:20:5-44
MERGED from [androidx.legacy:legacy-support-core-utils:1.0.0] C:\Users\sergi\.gradle\caches\transforms-1\files-1.1\legacy-support-core-utils-1.0.0.aar\abf3723886f7881e8de8fe5cecbac099\AndroidManifest.xml:20:5-44
MERGED from [androidx.loader:loader:1.0.0] C:\Users\sergi\.gradle\caches\transforms-1\files-1.1\loader-1.0.0.aar\4facc5caf65a060a2cfc0b5e3615f13c\AndroidManifest.xml:20:5-44
MERGED from [androidx.loader:loader:1.0.0] C:\Users\sergi\.gradle\caches\transforms-1\files-1.1\loader-1.0.0.aar\4facc5caf65a060a2cfc0b5e3615f13c\AndroidManifest.xml:20:5-44
MERGED from [androidx.viewpager:viewpager:1.0.0] C:\Users\sergi\.gradle\caches\transforms-1\files-1.1\viewpager-1.0.0.aar\352496ca226bb4e10f3aa5fe329b7d47\AndroidManifest.xml:20:5-44
MERGED from [androidx.viewpager:viewpager:1.0.0] C:\Users\sergi\.gradle\caches\transforms-1\files-1.1\viewpager-1.0.0.aar\352496ca226bb4e10f3aa5fe329b7d47\AndroidManifest.xml:20:5-44
MERGED from [androidx.coordinatorlayout:coordinatorlayout:1.0.0] C:\Users\sergi\.gradle\caches\transforms-1\files-1.1\coordinatorlayout-1.0.0.aar\2038a5975c34f1e0ebaaf69b92bb484c\AndroidManifest.xml:20:5-44
MERGED from [androidx.coordinatorlayout:coordinatorlayout:1.0.0] C:\Users\sergi\.gradle\caches\transforms-1\files-1.1\coordinatorlayout-1.0.0.aar\2038a5975c34f1e0ebaaf69b92bb484c\AndroidManifest.xml:20:5-44
MERGED from [androidx.drawerlayout:drawerlayout:1.0.0] C:\Users\sergi\.gradle\caches\transforms-1\files-1.1\drawerlayout-1.0.0.aar\3c6ede4a4125a77f0d45751fc555f58a\AndroidManifest.xml:20:5-44
MERGED from [androidx.drawerlayout:drawerlayout:1.0.0] C:\Users\sergi\.gradle\caches\transforms-1\files-1.1\drawerlayout-1.0.0.aar\3c6ede4a4125a77f0d45751fc555f58a\AndroidManifest.xml:20:5-44
MERGED from [androidx.slidingpanelayout:slidingpanelayout:1.0.0] C:\Users\sergi\.gradle\caches\transforms-1\files-1.1\slidingpanelayout-1.0.0.aar\877ed850a4e30c49e81f0933ebd7e29e\AndroidManifest.xml:20:5-44
MERGED from [androidx.slidingpanelayout:slidingpanelayout:1.0.0] C:\Users\sergi\.gradle\caches\transforms-1\files-1.1\slidingpanelayout-1.0.0.aar\877ed850a4e30c49e81f0933ebd7e29e\AndroidManifest.xml:20:5-44
MERGED from [androidx.customview:customview:1.0.0] C:\Users\sergi\.gradle\caches\transforms-1\files-1.1\customview-1.0.0.aar\b2278abf1db82b42ca7cc6278b236e71\AndroidManifest.xml:20:5-44
MERGED from [androidx.customview:customview:1.0.0] C:\Users\sergi\.gradle\caches\transforms-1\files-1.1\customview-1.0.0.aar\b2278abf1db82b42ca7cc6278b236e71\AndroidManifest.xml:20:5-44
MERGED from [androidx.swiperefreshlayout:swiperefreshlayout:1.0.0] C:\Users\sergi\.gradle\caches\transforms-1\files-1.1\swiperefreshlayout-1.0.0.aar\51d165456f36053c5886f27e0f65783b\AndroidManifest.xml:20:5-44
MERGED from [androidx.swiperefreshlayout:swiperefreshlayout:1.0.0] C:\Users\sergi\.gradle\caches\transforms-1\files-1.1\swiperefreshlayout-1.0.0.aar\51d165456f36053c5886f27e0f65783b\AndroidManifest.xml:20:5-44
MERGED from [androidx.asynclayoutinflater:asynclayoutinflater:1.0.0] C:\Users\sergi\.gradle\caches\transforms-1\files-1.1\asynclayoutinflater-1.0.0.aar\a826cc2e794f8e72c2eb28417ec2e435\AndroidManifest.xml:20:5-44
MERGED from [androidx.asynclayoutinflater:asynclayoutinflater:1.0.0] C:\Users\sergi\.gradle\caches\transforms-1\files-1.1\asynclayoutinflater-1.0.0.aar\a826cc2e794f8e72c2eb28417ec2e435\AndroidManifest.xml:20:5-44
MERGED from [androidx.core:core:1.0.0] C:\Users\sergi\.gradle\caches\transforms-1\files-1.1\core-1.0.0.aar\7fd24d2c592542aadd89b594e00d3072\AndroidManifest.xml:20:5-44
MERGED from [androidx.core:core:1.0.0] C:\Users\sergi\.gradle\caches\transforms-1\files-1.1\core-1.0.0.aar\7fd24d2c592542aadd89b594e00d3072\AndroidManifest.xml:20:5-44
MERGED from [androidx.versionedparcelable:versionedparcelable:1.0.0] C:\Users\sergi\.gradle\caches\transforms-1\files-1.1\versionedparcelable-1.0.0.aar\fcfaeee214f8bf90c82676ac32cffd18\AndroidManifest.xml:20:5-44
MERGED from [androidx.versionedparcelable:versionedparcelable:1.0.0] C:\Users\sergi\.gradle\caches\transforms-1\files-1.1\versionedparcelable-1.0.0.aar\fcfaeee214f8bf90c82676ac32cffd18\AndroidManifest.xml:20:5-44
MERGED from [androidx.lifecycle:lifecycle-runtime:2.0.0] C:\Users\sergi\.gradle\caches\transforms-1\files-1.1\lifecycle-runtime-2.0.0.aar\16078c521e703f0ac06572361765a1ef\AndroidManifest.xml:20:5-44
MERGED from [androidx.lifecycle:lifecycle-runtime:2.0.0] C:\Users\sergi\.gradle\caches\transforms-1\files-1.1\lifecycle-runtime-2.0.0.aar\16078c521e703f0ac06572361765a1ef\AndroidManifest.xml:20:5-44
MERGED from [androidx.documentfile:documentfile:1.0.0] C:\Users\sergi\.gradle\caches\transforms-1\files-1.1\documentfile-1.0.0.aar\e458c5fdf9f6f11409513809c1c315fc\AndroidManifest.xml:20:5-44
MERGED from [androidx.documentfile:documentfile:1.0.0] C:\Users\sergi\.gradle\caches\transforms-1\files-1.1\documentfile-1.0.0.aar\e458c5fdf9f6f11409513809c1c315fc\AndroidManifest.xml:20:5-44
MERGED from [androidx.localbroadcastmanager:localbroadcastmanager:1.0.0] C:\Users\sergi\.gradle\caches\transforms-1\files-1.1\localbroadcastmanager-1.0.0.aar\ca6d2926ee6a16bd087cda9f949b8353\AndroidManifest.xml:20:5-44
MERGED from [androidx.localbroadcastmanager:localbroadcastmanager:1.0.0] C:\Users\sergi\.gradle\caches\transforms-1\files-1.1\localbroadcastmanager-1.0.0.aar\ca6d2926ee6a16bd087cda9f949b8353\AndroidManifest.xml:20:5-44
MERGED from [androidx.print:print:1.0.0] C:\Users\sergi\.gradle\caches\transforms-1\files-1.1\print-1.0.0.aar\f5195e49519f24105aff9d75f907389b\AndroidManifest.xml:20:5-44
MERGED from [androidx.print:print:1.0.0] C:\Users\sergi\.gradle\caches\transforms-1\files-1.1\print-1.0.0.aar\f5195e49519f24105aff9d75f907389b\AndroidManifest.xml:20:5-44
MERGED from [androidx.interpolator:interpolator:1.0.0] C:\Users\sergi\.gradle\caches\transforms-1\files-1.1\interpolator-1.0.0.aar\667eb5d90710bdfae5126dadda0cc43d\AndroidManifest.xml:20:5-44
MERGED from [androidx.interpolator:interpolator:1.0.0] C:\Users\sergi\.gradle\caches\transforms-1\files-1.1\interpolator-1.0.0.aar\667eb5d90710bdfae5126dadda0cc43d\AndroidManifest.xml:20:5-44
MERGED from [androidx.cursoradapter:cursoradapter:1.0.0] C:\Users\sergi\.gradle\caches\transforms-1\files-1.1\cursoradapter-1.0.0.aar\1a46d9cfa1ae9d51a612dcc5d375f56a\AndroidManifest.xml:20:5-44
MERGED from [androidx.cursoradapter:cursoradapter:1.0.0] C:\Users\sergi\.gradle\caches\transforms-1\files-1.1\cursoradapter-1.0.0.aar\1a46d9cfa1ae9d51a612dcc5d375f56a\AndroidManifest.xml:20:5-44
MERGED from [androidx.lifecycle:lifecycle-viewmodel:2.0.0] C:\Users\sergi\.gradle\caches\transforms-1\files-1.1\lifecycle-viewmodel-2.0.0.aar\9ce9490dca2bb54959586f4e291c5fbf\AndroidManifest.xml:20:5-44
MERGED from [androidx.lifecycle:lifecycle-viewmodel:2.0.0] C:\Users\sergi\.gradle\caches\transforms-1\files-1.1\lifecycle-viewmodel-2.0.0.aar\9ce9490dca2bb54959586f4e291c5fbf\AndroidManifest.xml:20:5-44
MERGED from [androidx.lifecycle:lifecycle-livedata:2.0.0] C:\Users\sergi\.gradle\caches\transforms-1\files-1.1\lifecycle-livedata-2.0.0.aar\88ce7a0251e085e9f5e34645dc291b0c\AndroidManifest.xml:20:5-44
MERGED from [androidx.lifecycle:lifecycle-livedata:2.0.0] C:\Users\sergi\.gradle\caches\transforms-1\files-1.1\lifecycle-livedata-2.0.0.aar\88ce7a0251e085e9f5e34645dc291b0c\AndroidManifest.xml:20:5-44
MERGED from [androidx.lifecycle:lifecycle-livedata-core:2.0.0] C:\Users\sergi\.gradle\caches\transforms-1\files-1.1\lifecycle-livedata-core-2.0.0.aar\dacc0eb2f371000ee9be366ca9cd52ed\AndroidManifest.xml:20:5-44
MERGED from [androidx.lifecycle:lifecycle-livedata-core:2.0.0] C:\Users\sergi\.gradle\caches\transforms-1\files-1.1\lifecycle-livedata-core-2.0.0.aar\dacc0eb2f371000ee9be366ca9cd52ed\AndroidManifest.xml:20:5-44
MERGED from [androidx.arch.core:core-runtime:2.0.0] C:\Users\sergi\.gradle\caches\transforms-1\files-1.1\core-runtime-2.0.0.aar\d2877b80342ca6ede9479c08ea9d6cad\AndroidManifest.xml:20:5-44
MERGED from [androidx.arch.core:core-runtime:2.0.0] C:\Users\sergi\.gradle\caches\transforms-1\files-1.1\core-runtime-2.0.0.aar\d2877b80342ca6ede9479c08ea9d6cad\AndroidManifest.xml:20:5-44
INJECTED from C:\Users\sergi\ionic\aurus_electoral_play-uuid\platforms\android\app\src\main\AndroidManifest.xml
INJECTED from C:\Users\sergi\ionic\aurus_electoral_play-uuid\platforms\android\app\src\main\AndroidManifest.xml
	android:targetSdkVersion
		INJECTED from C:\Users\sergi\ionic\aurus_electoral_play-uuid\platforms\android\app\src\main\AndroidManifest.xml
		ADDED from C:\Users\sergi\ionic\aurus_electoral_play-uuid\platforms\android\app\src\main\AndroidManifest.xml
		INJECTED from C:\Users\sergi\ionic\aurus_electoral_play-uuid\platforms\android\app\src\main\AndroidManifest.xml
	android:minSdkVersion
		INJECTED from C:\Users\sergi\ionic\aurus_electoral_play-uuid\platforms\android\app\src\main\AndroidManifest.xml
		ADDED from C:\Users\sergi\ionic\aurus_electoral_play-uuid\platforms\android\app\src\main\AndroidManifest.xml
		INJECTED from C:\Users\sergi\ionic\aurus_electoral_play-uuid\platforms\android\app\src\main\AndroidManifest.xml
meta-data#android.support.FILE_PROVIDER_PATHS
ADDED from C:\Users\sergi\ionic\aurus_electoral_play-uuid\platforms\android\app\src\main\AndroidManifest.xml:18:13-115
	android:resource
		ADDED from C:\Users\sergi\ionic\aurus_electoral_play-uuid\platforms\android\app\src\main\AndroidManifest.xml:18:75-112
	android:name
		ADDED from C:\Users\sergi\ionic\aurus_electoral_play-uuid\platforms\android\app\src\main\AndroidManifest.xml:18:24-74
