-- Merging decision tree log ---
manifest
ADDED from C:\Users\sergi\ionic\aurus_electoral_play\platforms\android\app\src\main\AndroidManifest.xml:2:1-17:12
INJECTED from C:\Users\sergi\ionic\aurus_electoral_play\platforms\android\app\src\main\AndroidManifest.xml:2:1-17:12
INJECTED from C:\Users\sergi\ionic\aurus_electoral_play\platforms\android\app\src\main\AndroidManifest.xml:2:1-17:12
INJECTED from C:\Users\sergi\ionic\aurus_electoral_play\platforms\android\app\src\main\AndroidManifest.xml:2:1-17:12
MERGED from [:CordovaLib] C:\Users\sergi\ionic\aurus_electoral_play\platforms\android\CordovaLib\build\intermediates\library_manifest\release\AndroidManifest.xml:20:1-27:12
INJECTED from C:\Users\sergi\ionic\aurus_electoral_play\platforms\android\app\src\main\AndroidManifest.xml:2:1-17:12
INJECTED from C:\Users\sergi\ionic\aurus_electoral_play\platforms\android\app\src\main\AndroidManifest.xml:2:1-17:12
INJECTED from C:\Users\sergi\ionic\aurus_electoral_play\platforms\android\app\src\main\AndroidManifest.xml:2:1-17:12
	package
		ADDED from C:\Users\sergi\ionic\aurus_electoral_play\platforms\android\app\src\main\AndroidManifest.xml:2:98-126
		INJECTED from C:\Users\sergi\ionic\aurus_electoral_play\platforms\android\app\src\main\AndroidManifest.xml
		INJECTED from C:\Users\sergi\ionic\aurus_electoral_play\platforms\android\app\src\main\AndroidManifest.xml
	android:versionName
		ADDED from C:\Users\sergi\ionic\aurus_electoral_play\platforms\android\app\src\main\AndroidManifest.xml:2:70-97
		INJECTED from C:\Users\sergi\ionic\aurus_electoral_play\platforms\android\app\src\main\AndroidManifest.xml
		INJECTED from C:\Users\sergi\ionic\aurus_electoral_play\platforms\android\app\src\main\AndroidManifest.xml
	android:hardwareAccelerated
		ADDED from C:\Users\sergi\ionic\aurus_electoral_play\platforms\android\app\src\main\AndroidManifest.xml:2:11-45
	xmlns:android
		ADDED from C:\Users\sergi\ionic\aurus_electoral_play\platforms\android\app\src\main\AndroidManifest.xml:2:127-185
	android:versionCode
		ADDED from C:\Users\sergi\ionic\aurus_electoral_play\platforms\android\app\src\main\AndroidManifest.xml:2:46-69
		INJECTED from C:\Users\sergi\ionic\aurus_electoral_play\platforms\android\app\src\main\AndroidManifest.xml
		INJECTED from C:\Users\sergi\ionic\aurus_electoral_play\platforms\android\app\src\main\AndroidManifest.xml
supports-screens
ADDED from C:\Users\sergi\ionic\aurus_electoral_play\platforms\android\app\src\main\AndroidManifest.xml:3:5-191
	android:largeScreens
		ADDED from C:\Users\sergi\ionic\aurus_electoral_play\platforms\android\app\src\main\AndroidManifest.xml:3:49-76
	android:smallScreens
		ADDED from C:\Users\sergi\ionic\aurus_electoral_play\platforms\android\app\src\main\AndroidManifest.xml:3:132-159
	android:normalScreens
		ADDED from C:\Users\sergi\ionic\aurus_electoral_play\platforms\android\app\src\main\AndroidManifest.xml:3:77-105
	android:xlargeScreens
		ADDED from C:\Users\sergi\ionic\aurus_electoral_play\platforms\android\app\src\main\AndroidManifest.xml:3:160-188
	android:resizeable
		ADDED from C:\Users\sergi\ionic\aurus_electoral_play\platforms\android\app\src\main\AndroidManifest.xml:3:106-131
	android:anyDensity
		ADDED from C:\Users\sergi\ionic\aurus_electoral_play\platforms\android\app\src\main\AndroidManifest.xml:3:23-48
uses-permission#android.permission.INTERNET
ADDED from C:\Users\sergi\ionic\aurus_electoral_play\platforms\android\app\src\main\AndroidManifest.xml:4:5-67
	android:name
		ADDED from C:\Users\sergi\ionic\aurus_electoral_play\platforms\android\app\src\main\AndroidManifest.xml:4:22-64
application
ADDED from C:\Users\sergi\ionic\aurus_electoral_play\platforms\android\app\src\main\AndroidManifest.xml:5:5-12:19
	android:supportsRtl
		ADDED from C:\Users\sergi\ionic\aurus_electoral_play\platforms\android\app\src\main\AndroidManifest.xml:5:182-208
	android:label
		ADDED from C:\Users\sergi\ionic\aurus_electoral_play\platforms\android\app\src\main\AndroidManifest.xml:5:88-120
	android:hardwareAccelerated
		ADDED from C:\Users\sergi\ionic\aurus_electoral_play\platforms\android\app\src\main\AndroidManifest.xml:5:18-52
	android:icon
		ADDED from C:\Users\sergi\ionic\aurus_electoral_play\platforms\android\app\src\main\AndroidManifest.xml:5:53-87
	android:networkSecurityConfig
		ADDED from C:\Users\sergi\ionic\aurus_electoral_play\platforms\android\app\src\main\AndroidManifest.xml:5:121-181
activity#io.ionic.auruselec.MainActivity
ADDED from C:\Users\sergi\ionic\aurus_electoral_play\platforms\android\app\src\main\AndroidManifest.xml:6:9-11:20
	android:label
		ADDED from C:\Users\sergi\ionic\aurus_electoral_play\platforms\android\app\src\main\AndroidManifest.xml:6:136-173
	android:launchMode
		ADDED from C:\Users\sergi\ionic\aurus_electoral_play\platforms\android\app\src\main\AndroidManifest.xml:6:174-204
	android:windowSoftInputMode
		ADDED from C:\Users\sergi\ionic\aurus_electoral_play\platforms\android\app\src\main\AndroidManifest.xml:6:296-338
	android:configChanges
		ADDED from C:\Users\sergi\ionic\aurus_electoral_play\platforms\android\app\src\main\AndroidManifest.xml:6:19-135
	android:theme
		ADDED from C:\Users\sergi\ionic\aurus_electoral_play\platforms\android\app\src\main\AndroidManifest.xml:6:233-295
	android:name
		ADDED from C:\Users\sergi\ionic\aurus_electoral_play\platforms\android\app\src\main\AndroidManifest.xml:6:205-232
intent-filter#action:name:android.intent.action.MAIN+category:name:android.intent.category.LAUNCHER
ADDED from C:\Users\sergi\ionic\aurus_electoral_play\platforms\android\app\src\main\AndroidManifest.xml:7:13-10:29
	android:label
		ADDED from C:\Users\sergi\ionic\aurus_electoral_play\platforms\android\app\src\main\AndroidManifest.xml:7:28-65
action#android.intent.action.MAIN
ADDED from C:\Users\sergi\ionic\aurus_electoral_play\platforms\android\app\src\main\AndroidManifest.xml:8:17-69
	android:name
		ADDED from C:\Users\sergi\ionic\aurus_electoral_play\platforms\android\app\src\main\AndroidManifest.xml:8:25-66
category#android.intent.category.LAUNCHER
ADDED from C:\Users\sergi\ionic\aurus_electoral_play\platforms\android\app\src\main\AndroidManifest.xml:9:17-77
	android:name
		ADDED from C:\Users\sergi\ionic\aurus_electoral_play\platforms\android\app\src\main\AndroidManifest.xml:9:27-74
uses-permission#android.permission.CALL_PHONE
ADDED from C:\Users\sergi\ionic\aurus_electoral_play\platforms\android\app\src\main\AndroidManifest.xml:13:5-69
	android:name
		ADDED from C:\Users\sergi\ionic\aurus_electoral_play\platforms\android\app\src\main\AndroidManifest.xml:13:22-66
uses-feature#android.hardware.telephony
ADDED from C:\Users\sergi\ionic\aurus_electoral_play\platforms\android\app\src\main\AndroidManifest.xml:14:5-88
	android:required
		ADDED from C:\Users\sergi\ionic\aurus_electoral_play\platforms\android\app\src\main\AndroidManifest.xml:14:61-85
	android:name
		ADDED from C:\Users\sergi\ionic\aurus_electoral_play\platforms\android\app\src\main\AndroidManifest.xml:14:19-60
uses-permission#android.permission.READ_CALENDAR
ADDED from C:\Users\sergi\ionic\aurus_electoral_play\platforms\android\app\src\main\AndroidManifest.xml:15:5-72
	android:name
		ADDED from C:\Users\sergi\ionic\aurus_electoral_play\platforms\android\app\src\main\AndroidManifest.xml:15:22-69
uses-permission#android.permission.WRITE_CALENDAR
ADDED from C:\Users\sergi\ionic\aurus_electoral_play\platforms\android\app\src\main\AndroidManifest.xml:16:5-73
	android:name
		ADDED from C:\Users\sergi\ionic\aurus_electoral_play\platforms\android\app\src\main\AndroidManifest.xml:16:22-70
uses-sdk
INJECTED from C:\Users\sergi\ionic\aurus_electoral_play\platforms\android\app\src\main\AndroidManifest.xml reason: use-sdk injection requested
INJECTED from C:\Users\sergi\ionic\aurus_electoral_play\platforms\android\app\src\main\AndroidManifest.xml
INJECTED from C:\Users\sergi\ionic\aurus_electoral_play\platforms\android\app\src\main\AndroidManifest.xml
MERGED from [:CordovaLib] C:\Users\sergi\ionic\aurus_electoral_play\platforms\android\CordovaLib\build\intermediates\library_manifest\release\AndroidManifest.xml:25:5-44
MERGED from [:CordovaLib] C:\Users\sergi\ionic\aurus_electoral_play\platforms\android\CordovaLib\build\intermediates\library_manifest\release\AndroidManifest.xml:25:5-44
INJECTED from C:\Users\sergi\ionic\aurus_electoral_play\platforms\android\app\src\main\AndroidManifest.xml
INJECTED from C:\Users\sergi\ionic\aurus_electoral_play\platforms\android\app\src\main\AndroidManifest.xml
	android:targetSdkVersion
		INJECTED from C:\Users\sergi\ionic\aurus_electoral_play\platforms\android\app\src\main\AndroidManifest.xml
		ADDED from C:\Users\sergi\ionic\aurus_electoral_play\platforms\android\app\src\main\AndroidManifest.xml
		INJECTED from C:\Users\sergi\ionic\aurus_electoral_play\platforms\android\app\src\main\AndroidManifest.xml
	android:minSdkVersion
		INJECTED from C:\Users\sergi\ionic\aurus_electoral_play\platforms\android\app\src\main\AndroidManifest.xml
		ADDED from C:\Users\sergi\ionic\aurus_electoral_play\platforms\android\app\src\main\AndroidManifest.xml
		INJECTED from C:\Users\sergi\ionic\aurus_electoral_play\platforms\android\app\src\main\AndroidManifest.xml
