<?xml version="1.0" encoding="UTF-8"?>
<!DOCTYPE svg PUBLIC "-//W3C//DTD SVG 1.1//EN" "http://www.w3.org/Graphics/SVG/1.1/DTD/svg11.dtd">
<!-- Creator: CorelDRAW X8 -->
<svg xmlns="http://www.w3.org/2000/svg" xml:space="preserve" width="10.4138mm" height="10.4138mm" version="1.1" style="shape-rendering:geometricPrecision; text-rendering:geometricPrecision; image-rendering:optimizeQuality; fill-rule:evenodd; clip-rule:evenodd"
viewBox="0 0 1041 1041"
 xmlns:xlink="http://www.w3.org/1999/xlink">
 <defs>
  <style type="text/css">
   <![CDATA[
    .fil0 {fill:#373435;fill-rule:nonzero}
   ]]>
  </style>
 </defs>
 <g id="Camada_x0020_1">
  <metadata id="CorelCorpID_0Corel-Layer"/>
  <path class="fil0" d="M760 738l-479 0c-12,0 -21,10 -21,22 0,12 9,22 21,22l479 0c12,0 22,-10 22,-22 0,-12 -10,-22 -22,-22zm-218 131l-261 0c-12,0 -21,9 -21,21 0,12 9,22 21,22l261 0c12,0 22,-10 22,-22 0,-12 -10,-21 -22,-21zm364 -646l-218 -218c-4,-4 -9,-6 -15,-6l-457 0c-48,0 -87,39 -87,87l0 870c0,48 39,87 87,87l609 0c48,0 87,-39 87,-87l0 -718c0,-6 -2,-11 -6,-15zm-211 -150l0 0 143 143 -100 0c-24,0 -43,-19 -43,-43l0 -100zm130 926l0 0 -609 0c-24,0 -43,-19 -43,-43l0 -870c0,-24 19,-44 43,-44l435 0 0 131c0,48 39,87 87,87l131 0 0 696c0,24 -20,43 -44,43zm-65 -391l-479 0c-12,0 -21,9 -21,21 0,12 9,22 21,22l479 0c12,0 22,-10 22,-22 0,-12 -10,-21 -22,-21zm0 -131l-479 0c-12,0 -21,10 -21,22 0,12 9,22 21,22l479 0c12,0 22,-10 22,-22 0,-12 -10,-22 -22,-22zm0 -130l-261 0c-12,0 -22,9 -22,21 0,12 10,22 22,22l261 0c12,0 22,-10 22,-22 0,-12 -10,-21 -22,-21zm-435 0l-44 0c-12,0 -21,9 -21,21 0,12 9,22 21,22l22 0c0,12 10,22 22,22 12,0 22,-10 22,-22l0 -4c25,-9 43,-33 43,-61 0,-36 -29,-65 -65,-65 -12,0 -22,-10 -22,-22 0,-12 10,-22 22,-22l43 0c12,0 22,-10 22,-22 0,-12 -10,-21 -22,-21l-21 0c0,-12 -10,-22 -22,-22 -12,0 -22,10 -22,22l0 4c-25,9 -43,33 -43,61 0,36 29,65 65,65 12,0 22,10 22,22 0,12 -10,22 -22,22z"/>
 </g>
</svg>
