<?xml version="1.0" encoding="UTF-8"?>
<!DOCTYPE svg PUBLIC "-//W3C//DTD SVG 1.1//EN" "http://www.w3.org/Graphics/SVG/1.1/DTD/svg11.dtd">
<!-- Creator: CorelDRAW X8 -->
<svg xmlns="http://www.w3.org/2000/svg" xml:space="preserve" width="10.4138mm" height="10.4138mm" version="1.1" style="shape-rendering:geometricPrecision; text-rendering:geometricPrecision; image-rendering:optimizeQuality; fill-rule:evenodd; clip-rule:evenodd"
viewBox="0 0 1041 1041"
 xmlns:xlink="http://www.w3.org/1999/xlink">
 <defs>
  <style type="text/css">
   <![CDATA[
    .fil0 {fill:#373435;fill-rule:nonzero}
   ]]>
  </style>
 </defs>
 <g id="Camada_x0020_1">
  <metadata id="CorelCorpID_0Corel-Layer"/>
  <path class="fil0" d="M393 1001c0,22 -18,40 -40,40l-136 0c-90,0 -163,-73 -163,-162l0 -716c0,-90 73,-163 163,-163l500 0c90,0 163,73 163,163l0 250c0,22 -19,41 -41,41 -23,0 -41,-19 -41,-41l0 -250c0,-45 -36,-82 -81,-82l-500 0c-45,0 -82,37 -82,82l0 716c0,45 37,81 82,81l136 0c22,0 40,18 40,41zm283 -757l0 0 -419 0c-22,0 -40,18 -40,41 0,22 18,40 40,40l419 0c23,0 41,-18 41,-40 0,-23 -18,-41 -41,-41zm41 203l0 0c0,-22 -18,-40 -41,-40l-419 0c-22,0 -40,18 -40,40 0,23 18,41 40,41l419 0c23,0 41,-18 41,-41zm-460 123l0 0c-22,0 -40,18 -40,40 0,23 18,41 40,41l255 0c22,0 40,-18 40,-41 0,-22 -18,-40 -40,-40l-255 0zm695 192l0 0 -223 222c-5,5 -11,9 -18,10l-164 46c-4,1 -8,1 -11,1 -11,0 -22,-4 -29,-12 -11,-11 -14,-26 -10,-40l49 -160c1,-7 5,-12 10,-17l223 -223c48,-48 125,-48 173,0 47,48 47,125 0,173zm-123 7l0 0 -58 -57 -151 150 -24 80 83 -23 150 -150zm65 -122l0 0c-16,-16 -42,-16 -57,0l-8 7 57 58 8 -8c16,-16 16,-42 0,-57z"/>
 </g>
</svg>
