EESchema Schematic File Version 4
EELAYER 30 0
EELAYER END
$Descr A4 11693 8268
encoding utf-8
Sheet 3 3
Title "SolderingRT1 - MCU"
Date "2020-03-71"
Rev "A"
Comp "PittiniHub"
Comment1 ""
Comment2 ""
Comment3 ""
Comment4 ""
$EndDescr
$Comp
L Device:C C?
U 1 1 5E56E859
P 5250 1200
AR Path="/5E56E859" Ref="C?"  Part="1" 
AR Path="/5E551509/5E56E859" Ref="C7c1"  Part="1" 
AR Path="/5E585963/5E56E859" Ref="C?"  Part="1" 
F 0 "C7c1" H 5365 1246 50  0000 L CNN
F 1 "100nF" H 5365 1155 50  0000 L CNN
F 2 "Capacitor_SMD:C_0603_1608Metric" H 5288 1050 50  0001 C CNN
F 3 "~" H 5250 1200 50  0001 C CNN
	1    5250 1200
	1    0    0    -1  
$EndComp
$Comp
L power:GND #PWR?
U 1 1 5E56E86B
P 5250 1350
AR Path="/5E56E86B" Ref="#PWR?"  Part="1" 
AR Path="/5E551509/5E56E86B" Ref="#PWR0137"  Part="1" 
AR Path="/5E585963/5E56E86B" Ref="#PWR?"  Part="1" 
F 0 "#PWR0137" H 5250 1100 50  0001 C CNN
F 1 "GND" H 5255 1177 50  0000 C CNN
F 2 "" H 5250 1350 50  0001 C CNN
F 3 "" H 5250 1350 50  0001 C CNN
	1    5250 1350
	1    0    0    -1  
$EndComp
$Comp
L Device:R R?
U 1 1 5E56E8F7
P 4400 2300
AR Path="/5E56E8F7" Ref="R?"  Part="1" 
AR Path="/5E551509/5E56E8F7" Ref="R3c1"  Part="1" 
AR Path="/5E585963/5E56E8F7" Ref="R?"  Part="1" 
F 0 "R3c1" H 4250 2300 50  0000 C CNN
F 1 "10k" V 4400 2300 50  0000 C CNN
F 2 "Resistor_SMD:R_0603_1608Metric" V 4330 2300 50  0001 C CNN
F 3 "~" H 4400 2300 50  0001 C CNN
	1    4400 2300
	-1   0    0    1   
$EndComp
Wire Wire Line
	4400 2550 4000 2550
Text Label 4050 2550 0    50   ~ 0
RES
$Comp
L MCU_Microchip_ATmega:ATmega32U4-AU U?
U 1 1 5E5714D4
P 5250 4100
AR Path="/5E5714D4" Ref="U?"  Part="1" 
AR Path="/5E551509/5E5714D4" Ref="U1c1"  Part="1" 
AR Path="/5E585963/5E5714D4" Ref="U?"  Part="1" 
F 0 "U1c1" H 5600 5850 50  0000 C CNN
F 1 "ATmega32U4-AU" H 5700 2300 50  0000 C CNN
F 2 "Package_QFP:TQFP-44_10x10mm_P0.8mm" H 5250 4100 50  0001 C CIN
F 3 "http://ww1.microchip.com/downloads/en/DeviceDoc/Atmel-7766-8-bit-AVR-ATmega16U4-32U4_Datasheet.pdf" H 5250 4100 50  0001 C CNN
	1    5250 4100
	1    0    0    -1  
$EndComp
$Comp
L Device:C C?
U 1 1 5E57327B
P 4800 1200
AR Path="/5E57327B" Ref="C?"  Part="1" 
AR Path="/5E551509/5E57327B" Ref="C6c1"  Part="1" 
AR Path="/5E585963/5E57327B" Ref="C?"  Part="1" 
F 0 "C6c1" H 4915 1246 50  0000 L CNN
F 1 "100nF" H 4915 1155 50  0000 L CNN
F 2 "Capacitor_SMD:C_0603_1608Metric" H 4838 1050 50  0001 C CNN
F 3 "~" H 4800 1200 50  0001 C CNN
	1    4800 1200
	1    0    0    -1  
$EndComp
$Comp
L power:GND #PWR?
U 1 1 5E573281
P 4800 1350
AR Path="/5E573281" Ref="#PWR?"  Part="1" 
AR Path="/5E551509/5E573281" Ref="#PWR0136"  Part="1" 
AR Path="/5E585963/5E573281" Ref="#PWR?"  Part="1" 
F 0 "#PWR0136" H 4800 1100 50  0001 C CNN
F 1 "GND" H 4805 1177 50  0000 C CNN
F 2 "" H 4800 1350 50  0001 C CNN
F 3 "" H 4800 1350 50  0001 C CNN
	1    4800 1350
	1    0    0    -1  
$EndComp
$Comp
L Device:C C?
U 1 1 5E573D06
P 4350 1200
AR Path="/5E573D06" Ref="C?"  Part="1" 
AR Path="/5E551509/5E573D06" Ref="C5c1"  Part="1" 
AR Path="/5E585963/5E573D06" Ref="C?"  Part="1" 
F 0 "C5c1" H 4465 1246 50  0000 L CNN
F 1 "100nF" H 4465 1155 50  0000 L CNN
F 2 "Capacitor_SMD:C_0603_1608Metric" H 4388 1050 50  0001 C CNN
F 3 "~" H 4350 1200 50  0001 C CNN
	1    4350 1200
	1    0    0    -1  
$EndComp
$Comp
L power:GND #PWR?
U 1 1 5E573D0C
P 4350 1350
AR Path="/5E573D0C" Ref="#PWR?"  Part="1" 
AR Path="/5E551509/5E573D0C" Ref="#PWR0138"  Part="1" 
AR Path="/5E585963/5E573D0C" Ref="#PWR?"  Part="1" 
F 0 "#PWR0138" H 4350 1100 50  0001 C CNN
F 1 "GND" H 4355 1177 50  0000 C CNN
F 2 "" H 4350 1350 50  0001 C CNN
F 3 "" H 4350 1350 50  0001 C CNN
	1    4350 1350
	1    0    0    -1  
$EndComp
$Comp
L Device:C C?
U 1 1 5E574927
P 5700 1200
AR Path="/5E574927" Ref="C?"  Part="1" 
AR Path="/5E551509/5E574927" Ref="C8c1"  Part="1" 
AR Path="/5E585963/5E574927" Ref="C?"  Part="1" 
F 0 "C8c1" H 5815 1246 50  0000 L CNN
F 1 "100nF" H 5815 1155 50  0000 L CNN
F 2 "Capacitor_SMD:C_0603_1608Metric" H 5738 1050 50  0001 C CNN
F 3 "~" H 5700 1200 50  0001 C CNN
	1    5700 1200
	1    0    0    -1  
$EndComp
$Comp
L power:GND #PWR?
U 1 1 5E57492D
P 5700 1350
AR Path="/5E57492D" Ref="#PWR?"  Part="1" 
AR Path="/5E551509/5E57492D" Ref="#PWR0139"  Part="1" 
AR Path="/5E585963/5E57492D" Ref="#PWR?"  Part="1" 
F 0 "#PWR0139" H 5700 1100 50  0001 C CNN
F 1 "GND" H 5705 1177 50  0000 C CNN
F 2 "" H 5700 1350 50  0001 C CNN
F 3 "" H 5700 1350 50  0001 C CNN
	1    5700 1350
	1    0    0    -1  
$EndComp
$Comp
L Device:C C?
U 1 1 5E57551E
P 6150 1200
AR Path="/5E57551E" Ref="C?"  Part="1" 
AR Path="/5E551509/5E57551E" Ref="C9c1"  Part="1" 
AR Path="/5E585963/5E57551E" Ref="C?"  Part="1" 
F 0 "C9c1" H 6265 1246 50  0000 L CNN
F 1 "100nF" H 6265 1155 50  0000 L CNN
F 2 "Capacitor_SMD:C_0603_1608Metric" H 6188 1050 50  0001 C CNN
F 3 "~" H 6150 1200 50  0001 C CNN
	1    6150 1200
	1    0    0    -1  
$EndComp
$Comp
L power:GND #PWR?
U 1 1 5E575524
P 6150 1350
AR Path="/5E575524" Ref="#PWR?"  Part="1" 
AR Path="/5E551509/5E575524" Ref="#PWR0140"  Part="1" 
AR Path="/5E585963/5E575524" Ref="#PWR?"  Part="1" 
F 0 "#PWR0140" H 6150 1100 50  0001 C CNN
F 1 "GND" H 6155 1177 50  0000 C CNN
F 2 "" H 6150 1350 50  0001 C CNN
F 3 "" H 6150 1350 50  0001 C CNN
	1    6150 1350
	1    0    0    -1  
$EndComp
$Comp
L power:+5V #PWR0141
U 1 1 5E576169
P 6150 1050
AR Path="/5E551509/5E576169" Ref="#PWR0141"  Part="1" 
AR Path="/5E585963/5E576169" Ref="#PWR?"  Part="1" 
F 0 "#PWR0141" H 6150 900 50  0001 C CNN
F 1 "+5V" H 6165 1223 50  0000 C CNN
F 2 "" H 6150 1050 50  0001 C CNN
F 3 "" H 6150 1050 50  0001 C CNN
	1    6150 1050
	1    0    0    -1  
$EndComp
$Comp
L power:+5V #PWR0142
U 1 1 5E5765CE
P 5700 1050
AR Path="/5E551509/5E5765CE" Ref="#PWR0142"  Part="1" 
AR Path="/5E585963/5E5765CE" Ref="#PWR?"  Part="1" 
F 0 "#PWR0142" H 5700 900 50  0001 C CNN
F 1 "+5V" H 5715 1223 50  0000 C CNN
F 2 "" H 5700 1050 50  0001 C CNN
F 3 "" H 5700 1050 50  0001 C CNN
	1    5700 1050
	1    0    0    -1  
$EndComp
$Comp
L power:+5V #PWR0143
U 1 1 5E576B81
P 5250 1050
AR Path="/5E551509/5E576B81" Ref="#PWR0143"  Part="1" 
AR Path="/5E585963/5E576B81" Ref="#PWR?"  Part="1" 
F 0 "#PWR0143" H 5250 900 50  0001 C CNN
F 1 "+5V" H 5265 1223 50  0000 C CNN
F 2 "" H 5250 1050 50  0001 C CNN
F 3 "" H 5250 1050 50  0001 C CNN
	1    5250 1050
	1    0    0    -1  
$EndComp
$Comp
L power:+5V #PWR0144
U 1 1 5E595721
P 4800 1050
AR Path="/5E551509/5E595721" Ref="#PWR0144"  Part="1" 
AR Path="/5E585963/5E595721" Ref="#PWR?"  Part="1" 
F 0 "#PWR0144" H 4800 900 50  0001 C CNN
F 1 "+5V" H 4815 1223 50  0000 C CNN
F 2 "" H 4800 1050 50  0001 C CNN
F 3 "" H 4800 1050 50  0001 C CNN
	1    4800 1050
	1    0    0    -1  
$EndComp
$Comp
L power:+5V #PWR0145
U 1 1 5E57778E
P 4350 1050
AR Path="/5E551509/5E57778E" Ref="#PWR0145"  Part="1" 
AR Path="/5E585963/5E57778E" Ref="#PWR?"  Part="1" 
F 0 "#PWR0145" H 4350 900 50  0001 C CNN
F 1 "+5V" H 4365 1223 50  0000 C CNN
F 2 "" H 4350 1050 50  0001 C CNN
F 3 "" H 4350 1050 50  0001 C CNN
	1    4350 1050
	1    0    0    -1  
$EndComp
$Comp
L power:+5V #PWR0146
U 1 1 5E577F2B
P 5150 2300
AR Path="/5E551509/5E577F2B" Ref="#PWR0146"  Part="1" 
AR Path="/5E585963/5E577F2B" Ref="#PWR?"  Part="1" 
F 0 "#PWR0146" H 5150 2150 50  0001 C CNN
F 1 "+5V" H 5165 2473 50  0000 C CNN
F 2 "" H 5150 2300 50  0001 C CNN
F 3 "" H 5150 2300 50  0001 C CNN
	1    5150 2300
	1    0    0    -1  
$EndComp
$Comp
L power:+5V #PWR0147
U 1 1 5E578A2A
P 5350 2300
AR Path="/5E551509/5E578A2A" Ref="#PWR0147"  Part="1" 
AR Path="/5E585963/5E578A2A" Ref="#PWR?"  Part="1" 
F 0 "#PWR0147" H 5350 2150 50  0001 C CNN
F 1 "+5V" H 5365 2473 50  0000 C CNN
F 2 "" H 5350 2300 50  0001 C CNN
F 3 "" H 5350 2300 50  0001 C CNN
	1    5350 2300
	1    0    0    -1  
$EndComp
$Comp
L power:+5V #PWR0148
U 1 1 5E580A05
P 5250 2050
AR Path="/5E551509/5E580A05" Ref="#PWR0148"  Part="1" 
AR Path="/5E585963/5E580A05" Ref="#PWR?"  Part="1" 
F 0 "#PWR0148" H 5250 1900 50  0001 C CNN
F 1 "+5V" H 5265 2223 50  0000 C CNN
F 2 "" H 5250 2050 50  0001 C CNN
F 3 "" H 5250 2050 50  0001 C CNN
	1    5250 2050
	1    0    0    -1  
$EndComp
Wire Wire Line
	5250 2050 5250 2300
$Comp
L Device:Crystal_GND24 Y?
U 1 1 5E58EAEE
P 3600 2900
AR Path="/5E58EAEE" Ref="Y?"  Part="1" 
AR Path="/5E551509/5E58EAEE" Ref="Y1c1"  Part="1" 
AR Path="/5E585963/5E58EAEE" Ref="Y?"  Part="1" 
F 0 "Y1c1" V 3350 2950 50  0000 L CNN
F 1 "16MHz" V 3350 2650 50  0000 L CNN
F 2 "Crystal:Crystal_SMD_3225-4Pin_3.2x2.5mm" H 3600 2900 50  0001 C CNN
F 3 "https://datasheet.lcsc.com/szlcsc/1810170919_TKD-SX32Y016000B91T_C271628.pdf" H 3600 2900 50  0001 C CNN
F 4 "C271628" V 3600 2900 50  0001 C CNN "LCSC"
	1    3600 2900
	0    1    1    0   
$EndComp
$Comp
L power:GND #PWR?
U 1 1 5E58EAF4
P 3800 2900
AR Path="/5E58EAF4" Ref="#PWR?"  Part="1" 
AR Path="/5E551509/5E58EAF4" Ref="#PWR0149"  Part="1" 
AR Path="/5E585963/5E58EAF4" Ref="#PWR?"  Part="1" 
F 0 "#PWR0149" H 3800 2650 50  0001 C CNN
F 1 "GND" H 3800 2750 50  0000 C CNN
F 2 "" H 3800 2900 50  0000 C CNN
F 3 "" H 3800 2900 50  0000 C CNN
	1    3800 2900
	0    -1   -1   0   
$EndComp
$Comp
L power:GND #PWR?
U 1 1 5E58EAFA
P 3400 2900
AR Path="/5E58EAFA" Ref="#PWR?"  Part="1" 
AR Path="/5E551509/5E58EAFA" Ref="#PWR0150"  Part="1" 
AR Path="/5E585963/5E58EAFA" Ref="#PWR?"  Part="1" 
F 0 "#PWR0150" H 3400 2650 50  0001 C CNN
F 1 "GND" H 3400 2750 50  0000 C CNN
F 2 "" H 3400 2900 50  0000 C CNN
F 3 "" H 3400 2900 50  0000 C CNN
	1    3400 2900
	0    1    1    0   
$EndComp
$Comp
L Device:C C?
U 1 1 5E58EB09
P 2650 3050
AR Path="/5E58EB09" Ref="C?"  Part="1" 
AR Path="/5E551509/5E58EB09" Ref="C4c1"  Part="1" 
AR Path="/5E585963/5E58EB09" Ref="C?"  Part="1" 
F 0 "C4c1" V 2700 3100 50  0000 L CNN
F 1 "22pF" V 2800 3100 50  0000 L CNN
F 2 "Capacitor_SMD:C_0603_1608Metric" H 2688 2900 50  0001 C CNN
F 3 "~" H 2650 3050 50  0001 C CNN
	1    2650 3050
	0    -1   -1   0   
$EndComp
$Comp
L Device:C C?
U 1 1 5E58EB0F
P 2650 2750
AR Path="/5E58EB0F" Ref="C?"  Part="1" 
AR Path="/5E551509/5E58EB0F" Ref="C3c1"  Part="1" 
AR Path="/5E585963/5E58EB0F" Ref="C?"  Part="1" 
F 0 "C3c1" V 2700 2800 50  0000 L CNN
F 1 "22pF" V 2800 2800 50  0000 L CNN
F 2 "Capacitor_SMD:C_0603_1608Metric" H 2688 2600 50  0001 C CNN
F 3 "~" H 2650 2750 50  0001 C CNN
	1    2650 2750
	0    -1   -1   0   
$EndComp
$Comp
L power:GND #PWR?
U 1 1 5E58EB15
P 2500 3050
AR Path="/5E58EB15" Ref="#PWR?"  Part="1" 
AR Path="/5E551509/5E58EB15" Ref="#PWR0151"  Part="1" 
AR Path="/5E585963/5E58EB15" Ref="#PWR?"  Part="1" 
F 0 "#PWR0151" H 2500 2800 50  0001 C CNN
F 1 "GND" V 2505 2922 50  0000 R CNN
F 2 "" H 2500 3050 50  0001 C CNN
F 3 "" H 2500 3050 50  0001 C CNN
	1    2500 3050
	0    1    1    0   
$EndComp
$Comp
L power:GND #PWR?
U 1 1 5E58EB1B
P 2500 2750
AR Path="/5E58EB1B" Ref="#PWR?"  Part="1" 
AR Path="/5E551509/5E58EB1B" Ref="#PWR0152"  Part="1" 
AR Path="/5E585963/5E58EB1B" Ref="#PWR?"  Part="1" 
F 0 "#PWR0152" H 2500 2500 50  0001 C CNN
F 1 "GND" V 2505 2622 50  0000 R CNN
F 2 "" H 2500 2750 50  0001 C CNN
F 3 "" H 2500 2750 50  0001 C CNN
	1    2500 2750
	0    1    1    0   
$EndComp
Wire Wire Line
	2800 3050 2900 3050
Wire Wire Line
	3600 2750 2900 2750
$Comp
L Device:R R?
U 1 1 5E59735A
P 2900 2900
AR Path="/5E59735A" Ref="R?"  Part="1" 
AR Path="/5E551509/5E59735A" Ref="R4c1"  Part="1" 
AR Path="/5E585963/5E59735A" Ref="R?"  Part="1" 
F 0 "R4c1" H 2750 2900 50  0000 C CNN
F 1 "1M" V 2900 2900 50  0000 C CNN
F 2 "Resistor_SMD:R_0603_1608Metric" V 2830 2900 50  0001 C CNN
F 3 "~" H 2900 2900 50  0001 C CNN
	1    2900 2900
	-1   0    0    1   
$EndComp
Connection ~ 2900 3050
Wire Wire Line
	2900 3050 3600 3050
Connection ~ 2900 2750
Wire Wire Line
	2900 2750 2800 2750
Wire Wire Line
	3600 2750 4500 2750
Wire Wire Line
	4500 2750 4500 2800
Wire Wire Line
	4500 2800 4650 2800
Connection ~ 3600 2750
Wire Wire Line
	4650 3000 4500 3000
Wire Wire Line
	4500 3000 4500 3050
Wire Wire Line
	4500 3050 3600 3050
Connection ~ 3600 3050
$Comp
L power:+5V #PWR0153
U 1 1 5E599A62
P 4400 2150
AR Path="/5E551509/5E599A62" Ref="#PWR0153"  Part="1" 
AR Path="/5E585963/5E599A62" Ref="#PWR?"  Part="1" 
F 0 "#PWR0153" H 4400 2000 50  0001 C CNN
F 1 "+5V" H 4415 2323 50  0000 C CNN
F 2 "" H 4400 2150 50  0001 C CNN
F 3 "" H 4400 2150 50  0001 C CNN
	1    4400 2150
	1    0    0    -1  
$EndComp
Wire Wire Line
	4650 2600 4400 2600
Wire Wire Line
	4400 2600 4400 2550
Connection ~ 4400 2550
Wire Wire Line
	4400 2550 4400 2450
$Comp
L Connector:USB_B_Micro P1c1
U 1 1 5E59B346
P 3400 3600
AR Path="/5E551509/5E59B346" Ref="P1c1"  Part="1" 
AR Path="/5E585963/5E59B346" Ref="P1c?"  Part="1" 
F 0 "P1c1" H 3250 3950 50  0000 C CNN
F 1 "USB_B_Micro" H 3700 3250 50  0000 C CNN
F 2 "Connector_USB:USB_Micro-B_Amphenol_10103594-0001LF_Horizontal" H 3550 3550 50  0001 C CNN
F 3 "https://datasheet.lcsc.com/szlcsc/1811131821_Jing-Extension-of-the-Electronic-Co-C40954_C40954.pdf" H 3550 3550 50  0001 C CNN
F 4 "C40954" H 3400 3600 50  0001 C CNN "LCSC"
	1    3400 3600
	1    0    0    -1  
$EndComp
$Comp
L Device:R R?
U 1 1 5E59D9E1
P 3950 3600
AR Path="/5E59D9E1" Ref="R?"  Part="1" 
AR Path="/5E551509/5E59D9E1" Ref="R1c1"  Part="1" 
AR Path="/5E585963/5E59D9E1" Ref="R?"  Part="1" 
F 0 "R1c1" V 4050 3600 50  0000 C CNN
F 1 "22" V 3950 3600 50  0000 C CNN
F 2 "Resistor_SMD:R_0603_1608Metric" V 3880 3600 50  0001 C CNN
F 3 "~" H 3950 3600 50  0001 C CNN
	1    3950 3600
	0    -1   -1   0   
$EndComp
$Comp
L Device:R R?
U 1 1 5E59E119
P 4300 3700
AR Path="/5E59E119" Ref="R?"  Part="1" 
AR Path="/5E551509/5E59E119" Ref="R2c1"  Part="1" 
AR Path="/5E585963/5E59E119" Ref="R?"  Part="1" 
F 0 "R2c1" V 4200 3700 50  0000 C CNN
F 1 "22" V 4300 3700 50  0000 C CNN
F 2 "Resistor_SMD:R_0603_1608Metric" V 4230 3700 50  0001 C CNN
F 3 "~" H 4300 3700 50  0001 C CNN
	1    4300 3700
	0    -1   -1   0   
$EndComp
Wire Wire Line
	4650 3600 4100 3600
Wire Wire Line
	3800 3600 3700 3600
Wire Wire Line
	4650 3700 4450 3700
Wire Wire Line
	4150 3700 3700 3700
Wire Wire Line
	3300 4000 3400 4000
$Comp
L power:GND #PWR?
U 1 1 5E5A021C
P 3400 4000
AR Path="/5E5A021C" Ref="#PWR?"  Part="1" 
AR Path="/5E551509/5E5A021C" Ref="#PWR0154"  Part="1" 
AR Path="/5E585963/5E5A021C" Ref="#PWR?"  Part="1" 
F 0 "#PWR0154" H 3400 3750 50  0001 C CNN
F 1 "GND" V 3405 3872 50  0000 R CNN
F 2 "" H 3400 4000 50  0001 C CNN
F 3 "" H 3400 4000 50  0001 C CNN
	1    3400 4000
	1    0    0    -1  
$EndComp
Connection ~ 3400 4000
$Comp
L Device:Net-Tie_2 NT1
U 1 1 5E5A0C97
P 3900 3400
AR Path="/5E551509/5E5A0C97" Ref="NT1"  Part="1" 
AR Path="/5E585963/5E5A0C97" Ref="NT?"  Part="1" 
F 0 "NT1" H 3900 3581 50  0000 C CNN
F 1 "Net-Tie_2" H 3900 3490 50  0000 C CNN
F 2 "NetTie:NetTie-2_SMD_Pad0.5mm" H 3900 3400 50  0001 C CNN
F 3 "~" H 3900 3400 50  0001 C CNN
	1    3900 3400
	1    0    0    -1  
$EndComp
Wire Wire Line
	3700 3400 3800 3400
$Comp
L power:+5V #PWR0155
U 1 1 5E5A1F2F
P 4250 3400
AR Path="/5E551509/5E5A1F2F" Ref="#PWR0155"  Part="1" 
AR Path="/5E585963/5E5A1F2F" Ref="#PWR?"  Part="1" 
F 0 "#PWR0155" H 4250 3250 50  0001 C CNN
F 1 "+5V" H 4265 3573 50  0000 C CNN
F 2 "" H 4250 3400 50  0001 C CNN
F 3 "" H 4250 3400 50  0001 C CNN
	1    4250 3400
	1    0    0    -1  
$EndComp
Wire Wire Line
	4650 3400 4250 3400
Connection ~ 4250 3400
Wire Wire Line
	4250 3400 4000 3400
Wire Wire Line
	5850 2700 6350 2700
Wire Wire Line
	5850 2800 6350 2800
Wire Wire Line
	5850 2900 6350 2900
Text Label 6150 2700 0    50   ~ 0
SCLK
Text Label 6150 2800 0    50   ~ 0
MOSI
Text Label 6150 2900 0    50   ~ 0
MISO
Text Label 6250 4300 0    50   ~ 0
GreenLED
$Comp
L power:GND #PWR?
U 1 1 5E5ACABC
P 5850 4700
AR Path="/5E5ACABC" Ref="#PWR?"  Part="1" 
AR Path="/5E551509/5E5ACABC" Ref="#PWR0156"  Part="1" 
AR Path="/5E585963/5E5ACABC" Ref="#PWR?"  Part="1" 
F 0 "#PWR0156" H 5850 4450 50  0001 C CNN
F 1 "GND" V 5855 4572 50  0000 R CNN
F 2 "" H 5850 4700 50  0001 C CNN
F 3 "" H 5850 4700 50  0001 C CNN
	1    5850 4700
	0    -1   -1   0   
$EndComp
$Comp
L power:GND #PWR?
U 1 1 5E5AD8CF
P 5150 5900
AR Path="/5E5AD8CF" Ref="#PWR?"  Part="1" 
AR Path="/5E551509/5E5AD8CF" Ref="#PWR0157"  Part="1" 
AR Path="/5E585963/5E5AD8CF" Ref="#PWR?"  Part="1" 
F 0 "#PWR0157" H 5150 5650 50  0001 C CNN
F 1 "GND" V 5155 5772 50  0000 R CNN
F 2 "" H 5150 5900 50  0001 C CNN
F 3 "" H 5150 5900 50  0001 C CNN
	1    5150 5900
	1    0    0    -1  
$EndComp
$Comp
L power:GND #PWR?
U 1 1 5E5AE01D
P 5250 5900
AR Path="/5E5AE01D" Ref="#PWR?"  Part="1" 
AR Path="/5E551509/5E5AE01D" Ref="#PWR0158"  Part="1" 
AR Path="/5E585963/5E5AE01D" Ref="#PWR?"  Part="1" 
F 0 "#PWR0158" H 5250 5650 50  0001 C CNN
F 1 "GND" V 5255 5772 50  0000 R CNN
F 2 "" H 5250 5900 50  0001 C CNN
F 3 "" H 5250 5900 50  0001 C CNN
	1    5250 5900
	1    0    0    -1  
$EndComp
$Comp
L Device:LED D1c1
U 1 1 5E5B0018
P 6750 4150
AR Path="/5E551509/5E5B0018" Ref="D1c1"  Part="1" 
AR Path="/5E585963/5E5B0018" Ref="D1c?"  Part="1" 
F 0 "D1c1" V 6789 4033 50  0000 R CNN
F 1 "LED" V 6698 4033 50  0000 R CNN
F 2 "LED_SMD:LED_0603_1608Metric" H 6750 4150 50  0001 C CNN
F 3 "~" H 6750 4150 50  0001 C CNN
	1    6750 4150
	0    -1   -1   0   
$EndComp
$Comp
L Device:R R?
U 1 1 5E5B1D4A
P 6750 3850
AR Path="/5E5B1D4A" Ref="R?"  Part="1" 
AR Path="/5E551509/5E5B1D4A" Ref="R5c1"  Part="1" 
AR Path="/5E585963/5E5B1D4A" Ref="R?"  Part="1" 
F 0 "R5c1" H 6600 3850 50  0000 C CNN
F 1 "2k4" V 6750 3850 50  0000 C CNN
F 2 "Resistor_SMD:R_0603_1608Metric" V 6680 3850 50  0001 C CNN
F 3 "~" H 6750 3850 50  0001 C CNN
	1    6750 3850
	-1   0    0    1   
$EndComp
$Comp
L power:+5V #PWR0159
U 1 1 5E5B2223
P 6750 3700
AR Path="/5E551509/5E5B2223" Ref="#PWR0159"  Part="1" 
AR Path="/5E585963/5E5B2223" Ref="#PWR?"  Part="1" 
F 0 "#PWR0159" H 6750 3550 50  0001 C CNN
F 1 "+5V" H 6765 3873 50  0000 C CNN
F 2 "" H 6750 3700 50  0001 C CNN
F 3 "" H 6750 3700 50  0001 C CNN
	1    6750 3700
	1    0    0    -1  
$EndComp
Wire Wire Line
	5850 4300 6750 4300
$Comp
L Device:C C9c?
U 1 1 5E5B82A4
P 2800 3450
AR Path="/5E5B82A4" Ref="C9c?"  Part="1" 
AR Path="/5E551509/5E5B82A4" Ref="C1c1"  Part="1" 
AR Path="/5E585963/5E5B82A4" Ref="C9c?"  Part="1" 
F 0 "C1c1" H 2915 3496 50  0000 L CNN
F 1 "100nF" H 2915 3405 50  0000 L CNN
F 2 "Capacitor_SMD:C_0603_1608Metric" H 2838 3300 50  0001 C CNN
F 3 "~" H 2800 3450 50  0001 C CNN
	1    2800 3450
	1    0    0    -1  
$EndComp
$Comp
L power:GND #PWR?
U 1 1 5E5B9033
P 2800 3600
AR Path="/5E5B9033" Ref="#PWR?"  Part="1" 
AR Path="/5E551509/5E5B9033" Ref="#PWR0160"  Part="1" 
AR Path="/5E585963/5E5B9033" Ref="#PWR?"  Part="1" 
F 0 "#PWR0160" H 2800 3350 50  0001 C CNN
F 1 "GND" V 2805 3472 50  0000 R CNN
F 2 "" H 2800 3600 50  0001 C CNN
F 3 "" H 2800 3600 50  0001 C CNN
	1    2800 3600
	1    0    0    -1  
$EndComp
Wire Wire Line
	4650 3200 4500 3200
Wire Wire Line
	4500 3200 4500 3150
Wire Wire Line
	2800 3150 2800 3300
Wire Wire Line
	2800 3150 4500 3150
$Comp
L Device:C C9c?
U 1 1 5E5BB31D
P 4250 4050
AR Path="/5E5BB31D" Ref="C9c?"  Part="1" 
AR Path="/5E551509/5E5BB31D" Ref="C2c1"  Part="1" 
AR Path="/5E585963/5E5BB31D" Ref="C9c?"  Part="1" 
F 0 "C2c1" H 4365 4096 50  0000 L CNN
F 1 "1uF" H 4365 4005 50  0000 L CNN
F 2 "Capacitor_SMD:C_0603_1608Metric" H 4288 3900 50  0001 C CNN
F 3 "~" H 4250 4050 50  0001 C CNN
	1    4250 4050
	1    0    0    -1  
$EndComp
$Comp
L power:GND #PWR?
U 1 1 5E5BBAA8
P 4250 4200
AR Path="/5E5BBAA8" Ref="#PWR?"  Part="1" 
AR Path="/5E551509/5E5BBAA8" Ref="#PWR0161"  Part="1" 
AR Path="/5E585963/5E5BBAA8" Ref="#PWR?"  Part="1" 
F 0 "#PWR0161" H 4250 3950 50  0001 C CNN
F 1 "GND" V 4255 4072 50  0000 R CNN
F 2 "" H 4250 4200 50  0001 C CNN
F 3 "" H 4250 4200 50  0001 C CNN
	1    4250 4200
	1    0    0    -1  
$EndComp
Wire Wire Line
	4650 3900 4250 3900
Text GLabel 4100 1050 0    50   Input ~ 0
+5V
Text GLabel 4100 1350 0    50   Input ~ 0
GND
Wire Wire Line
	4100 1050 4150 1050
Connection ~ 4350 1050
Wire Wire Line
	4100 1350 4150 1350
Connection ~ 4350 1350
Wire Wire Line
	3200 5200 3500 5200
Wire Wire Line
	3200 5300 3500 5300
Wire Wire Line
	3200 5400 3500 5400
Text Label 3250 5400 0    50   ~ 0
RST
Text Label 3250 5300 0    50   ~ 0
SCLK
Text Label 3250 5200 0    50   ~ 0
MISO
Wire Wire Line
	4000 5300 4300 5300
Text Label 4050 5300 0    50   ~ 0
MOSI
$Comp
L power:+5V #PWR0162
U 1 1 5E5C5D92
P 4200 5200
AR Path="/5E551509/5E5C5D92" Ref="#PWR0162"  Part="1" 
AR Path="/5E585963/5E5C5D92" Ref="#PWR?"  Part="1" 
F 0 "#PWR0162" H 4200 5050 50  0001 C CNN
F 1 "+5V" H 4215 5373 50  0000 C CNN
F 2 "" H 4200 5200 50  0001 C CNN
F 3 "" H 4200 5200 50  0001 C CNN
	1    4200 5200
	1    0    0    -1  
$EndComp
$Comp
L power:GND #PWR?
U 1 1 5E5C64B8
P 4200 5400
AR Path="/5E5C64B8" Ref="#PWR?"  Part="1" 
AR Path="/5E551509/5E5C64B8" Ref="#PWR0163"  Part="1" 
AR Path="/5E585963/5E5C64B8" Ref="#PWR?"  Part="1" 
F 0 "#PWR0163" H 4200 5150 50  0001 C CNN
F 1 "GND" V 4205 5272 50  0000 R CNN
F 2 "" H 4200 5400 50  0001 C CNN
F 3 "" H 4200 5400 50  0001 C CNN
	1    4200 5400
	1    0    0    -1  
$EndComp
$Comp
L Connector_Generic:Conn_02x03_Odd_Even P2c1
U 1 1 5E5CAAA9
P 3700 5300
AR Path="/5E551509/5E5CAAA9" Ref="P2c1"  Part="1" 
AR Path="/5E585963/5E5CAAA9" Ref="P2c?"  Part="1" 
F 0 "P2c1" H 3750 5617 50  0000 C CNN
F 1 "Conn_02x03_Odd_Even" H 3750 5526 50  0000 C CNN
F 2 "Connector_PinHeader_2.54mm:PinHeader_2x03_P2.54mm_Vertical" H 3700 5300 50  0001 C CNN
F 3 "~" H 3700 5300 50  0001 C CNN
	1    3700 5300
	1    0    0    -1  
$EndComp
Wire Wire Line
	4000 5200 4200 5200
Wire Wire Line
	4200 5400 4000 5400
Wire Notes Line
	2850 4750 4500 4750
Wire Notes Line
	4500 4750 4500 5800
Wire Notes Line
	4500 5800 2850 5800
Wire Notes Line
	2850 5800 2850 4750
Text Notes 2900 4850 0    50   ~ 0
Programming Connector
Text HLabel 5850 5500 2    79   Input ~ 0
A0
Text HLabel 5850 5400 2    79   Input ~ 0
A1
Text HLabel 5850 5300 2    79   Input ~ 0
A2
Text HLabel 5850 5200 2    79   Input ~ 0
A3
Text HLabel 5850 5100 2    79   Input ~ 0
A4
Text HLabel 5850 5000 2    79   Input ~ 0
A5
Text HLabel 5850 4800 2    79   Input ~ 0
D7
Text HLabel 5850 4500 2    79   Input ~ 0
D6-A7
Text HLabel 5850 4400 2    79   Input ~ 0
D12
Text HLabel 4100 950  0    79   Input ~ 0
+5V
Text HLabel 4100 1450 0    79   Input ~ 0
GND
Wire Wire Line
	4100 950  4150 950 
Wire Wire Line
	4150 950  4150 1050
Connection ~ 4150 1050
Wire Wire Line
	4150 1050 4350 1050
Wire Wire Line
	4100 1450 4150 1450
Wire Wire Line
	4150 1450 4150 1350
Connection ~ 4150 1350
Wire Wire Line
	4150 1350 4350 1350
Text HLabel 5850 4000 2    79   Input ~ 0
D0-RX
Text HLabel 5850 3900 2    79   Input ~ 0
D2-SDA
Text HLabel 5850 3800 2    79   Input ~ 0
D3-SCL
Text HLabel 5850 4100 2    79   Input ~ 0
D1-TX
Text HLabel 5850 4200 2    79   Input ~ 0
D4-A6
Text HLabel 5850 3600 2    79   Input ~ 0
D13
Text HLabel 5850 3500 2    79   Input ~ 0
D5
Text HLabel 5850 3300 2    79   Input ~ 0
D11
Text HLabel 5850 3200 2    79   Input ~ 0
D10-A10
Text HLabel 5850 3100 2    79   Input ~ 0
D9-A9
Text HLabel 5850 3000 2    79   Input ~ 0
D8-A8
Text HLabel 6350 2900 2    79   Input ~ 0
D14-MISO
Text HLabel 6350 2800 2    79   Input ~ 0
D16-MOSI
Text HLabel 6350 2700 2    79   Input ~ 0
D15-SCLK
Text HLabel 5850 2600 2    79   Input ~ 0
D14
Text HLabel 4000 2550 0    79   Input ~ 0
RST
$EndSCHEMATC
