{
  "results": [
    {
      "command": "sett encrypt local -q -s 865079A1B73BA3F11ED0BDF7A5A9FEB57294CC4D -r 865079A1B73BA3F11ED0BDF7A5A9FEB57294CC4D -p benchmarks -o local-encrypt.zip data >> benchmarks/local-encrypt-output-20mb.txt 2>&1",
      "mean": 0.31293067382,
      "stddev": 0.004952886531402192,
      "median": 0.31159125302,
      "user": 0.29642093999999997,
      "system": 0.052903860000000004,
      "min": 0.30751247502,
      "max": 0.32039993302,
      "times": [
        0.31023708102,
        0.31159125302,
        0.31491262702,
        0.32039993302,
        0.30751247502
      ],
      "exit_codes": [
        0,
        0,
        0,
        0,
        0
      ]
    }
  ]
}
