{
  "results": [
    {
      "command": "sett decrypt -q -s 865079A1B73BA3F11ED0BDF7A5A9FEB57294CC4D -r 865079A1B73BA3F11ED0BDF7A5A9FEB57294CC4D -p benchmarks local-encrypt.zip >> benchmarks/decrypt-output-300mb.txt 2>&1",
      "mean": 2.7648651694599997,
      "stddev": 0.00403323436515303,
      "median": 2.76428349386,
      "user": 2.4656218,
      "system": 0.3001511,
      "min": 2.75953801286,
      "max": 2.77065385086,
      "times": [
        2.75953801286,
        2.77065385086,
        2.7661158168599997,
        2.76373467286,
        2.76428349386
      ],
      "exit_codes": [
        0,
        0,
        0,
        0,
        0
      ]
    }
  ]
}
