{
  "results": [
    {
      "command": "sett encrypt local -q -s 865079A1B73BA3F11ED0BDF7A5A9FEB57294CC4D -r 865079A1B73BA3F11ED0BDF7A5A9FEB57294CC4D -p benchmarks -o local-encrypt.zip data >> benchmarks/local-encrypt-output-300mb.txt 2>&1",
      "mean": 5.05454973512,
      "stddev": 0.8413552614709857,
      "median": 5.06437429192,
      "user": 3.8226266000000004,
      "system": 0.36432507999999997,
      "min": 4.31322060092,
      "max": 6.4000422309200005,
      "times": [
        6.4000422309200005,
        5.12372638792,
        4.37138516392,
        5.06437429192,
        4.31322060092
      ],
      "exit_codes": [
        0,
        0,
        0,
        0,
        0
      ]
    }
  ]
}
