{
  "results": [
    {
      "command": "sett encrypt s3 -q -b transfers --access-key vagrant --secret-key tQmNhhLNhRX9 -s 865079A1B73BA3F11ED0BDF7A5A9FEB57294CC4D -r 865079A1B73BA3F11ED0BDF7A5A9FEB57294CC4D -p benchmarks -e http://localhost:9000 data >> benchmarks/s3-encrypt-output-1000mb.txt 2>&1",
      "mean": 34.90457710788,
      "stddev": 0.5713782385870727,
      "median": 35.10277002328,
      "user": 35.05971116,
      "system": 4.999317759999999,
      "min": 33.94969895328,
      "max": 35.389999331279995,
      "times": [
        35.10277002328,
        35.243177945279996,
        34.837239286279996,
        33.94969895328,
        35.389999331279995
      ],
      "exit_codes": [
        0,
        0,
        0,
        0,
        0
      ]
    }
  ]
}
