{
  "results": [
    {
      "command": "sett encrypt s3 -q -b sett-transfers --access-key minioadmin --secret-key SuC72bEWZ8ZFb65NLxSK -s 865079A1B73BA3F11ED0BDF7A5A9FEB57294CC4D -r 865079A1B73BA3F11ED0BDF7A5A9FEB57294CC4D -p benchmarks -e https://fl-1-209.unil.cloud.switch.ch:9000 data >> benchmarks/s3-encrypt-output-300mb.txt 2>&1",
      "mean": 16.08196842186,
      "stddev": 0.24457280894102382,
      "median": 16.00866960006,
      "user": 7.407849379999999,
      "system": 0.19696574,
      "min": 15.874220368060001,
      "max": 16.46482809806,
      "times": [
        15.874220368060001,
        16.170645347060002,
        15.89147869606,
        16.46482809806,
        16.00866960006
      ],
      "exit_codes": [
        0,
        0,
        0,
        0,
        0
      ]
    }
  ]
}
