{
  "results": [
    {
      "command": "sett encrypt local -q -s 865079A1B73BA3F11ED0BDF7A5A9FEB57294CC4D -r 865079A1B73BA3F11ED0BDF7A5A9FEB57294CC4D -p benchmarks -o local-encrypt.zip data >> benchmarks/local-encrypt-output-1000mb.txt 2>&1",
      "mean": 15.42053365228,
      "stddev": 1.1124033639845916,
      "median": 15.91612491868,
      "user": 12.670714319999998,
      "system": 1.0545325199999998,
      "min": 13.431389253679999,
      "max": 15.947996908679999,
      "times": [
        15.91612491868,
        15.86768622268,
        15.947996908679999,
        13.431389253679999,
        15.93947095768
      ],
      "exit_codes": [
        0,
        0,
        0,
        0,
        0
      ]
    }
  ]
}
