-------------------------------------------------------------------------------
Test set: com.jogodavelha_v2.api_jogo.AppTest
-------------------------------------------------------------------------------
Tests run: 1, Failures: 0, Errors: 0, Skipped: 0, Time elapsed: 0.03 s - in com.jogodavelha_v2.api_jogo.AppTest
