<svg width="40" height="40" viewBox="0 0 40 40" fill="none" xmlns="http://www.w3.org/2000/svg">
<circle cx="20" cy="20" r="20" fill="#E55D8C"/>
<path d="M21.1543 30.3846L23.462 29.2307L25.7697 30.3846V22.3077H21.1543V30.3846ZM25.7697 16.5384V14.2307L23.462 15.3846L21.1543 14.2307V16.5384L18.8467 17.6923L21.1543 18.8461V21.1538L23.462 20L25.7697 21.1538V18.8461L28.0774 17.6923L25.7697 16.5384ZM29.2313 9.61536H10.7697C10.1577 9.61536 9.57072 9.85849 9.13794 10.2913C8.70517 10.724 8.46204 11.311 8.46204 11.923V23.4615C8.46204 24.0735 8.70517 24.6605 9.13794 25.0933C9.57072 25.5261 10.1577 25.7692 10.7697 25.7692H18.8467V23.4615H10.7697V11.923H29.2313V23.4615H28.0774V25.7692H29.2313C29.8433 25.7692 30.4303 25.5261 30.8631 25.0933C31.2958 24.6605 31.539 24.0735 31.539 23.4615V11.923C31.539 11.311 31.2958 10.724 30.8631 10.2913C30.4303 9.85849 29.8433 9.61536 29.2313 9.61536ZM18.8467 15.3846H11.9236V13.0769H18.8467V15.3846ZM16.539 18.8461H11.9236V16.5384H16.539V18.8461ZM18.8467 22.3077H11.9236V20H18.8467V22.3077Z" fill="white"/>
</svg>
