{
  "iisSettings": {
    "windowsAuthentication": false,
    "anonymousAuthentication": true
  },
  "$schema": "http://json.schemastore.org/launchsettings.json",
  "profiles": {
    "IAEA.Api": {
      "commandName": "Project",
      "launchBrowser": false,
      "environmentVariables": {
        "ASPNETCORE_ENVIRONMENT": "Development"
      },
      "applicationUrl": "https://localhost:5001;http://localhost:5000"
    },
    "Docker": {
      "commandName": "Docker",
      "launchBrowser": false,
      "publishAllPorts": true,
      "useSSL": true
    }
  }
}