<svg width="25" height="25" viewBox="0 0 25 25" fill="none" xmlns="http://www.w3.org/2000/svg">
<g clip-path="url(#clip0)">
<path d="M17.1779 11.7844C16.3343 11.7844 15.6441 12.449 15.6441 13.2926C15.6441 14.1362 16.3343 14.8263 17.1523 14.8263C17.9959 14.8263 18.6605 14.1362 18.6605 13.3182C18.6861 12.449 18.0214 11.7844 17.1779 11.7844ZM17.1779 14.0595C16.7433 14.0595 16.411 13.7272 16.411 13.2926C16.411 12.858 16.7433 12.5257 17.1779 12.5257C17.6124 12.5257 17.9447 12.8836 17.9447 13.2926C17.9447 13.7272 17.5869 14.0595 17.1779 14.0595Z" fill="#cc9933"/>
<path d="M7.7965 9.58598C5.77707 9.56042 4.01327 11.2475 4.06439 13.3948C4.08996 15.3886 5.75151 17.1013 7.84762 17.0757C9.89261 17.0502 11.5542 15.3886 11.5542 13.3436C11.5542 11.2731 9.89261 9.58598 7.7965 9.58598ZM7.84762 15.6187C6.49282 15.6698 5.39364 14.5962 5.39364 13.2925C5.39364 11.9633 6.49282 10.9408 7.71981 10.9663C8.99793 10.9663 10.046 11.9888 10.046 13.2925C10.0715 14.5962 9.04905 15.5676 7.84762 15.6187Z" fill="#cc9933"/>
<path d="M12.5 0C5.59815 0 0 5.59815 0 12.5C0 19.4018 5.59815 25 12.5 25C19.4018 25 25 19.4018 25 12.5C25 5.59815 19.4018 0 12.5 0ZM19.683 17.3568C18.9161 17.8425 18.0726 18.0726 17.1779 18.0726C16.7945 18.0726 16.411 18.0215 16.0532 17.9192C15.1585 17.6891 14.3916 17.229 13.7525 16.5644C13.6759 16.4877 13.5992 16.3855 13.4969 16.2832C13.1646 16.7945 12.8323 17.2801 12.5 17.7914C12.1677 17.2801 11.8354 16.7945 11.5031 16.3088C11.4775 16.3088 11.4775 16.3343 11.4775 16.3343L11.4519 16.3599C10.6851 17.2801 9.71369 17.817 8.53782 18.0215C7.8732 18.1237 7.23414 18.0981 6.59509 17.9192C5.7004 17.6636 4.93353 17.2035 4.29447 16.4877C3.68098 15.7975 3.3231 15.0051 3.16973 14.0849C3.01636 13.2413 3.19529 12.4233 3.24642 12.2188C3.39979 11.6309 3.62985 11.1196 3.98773 10.6339C4.01329 10.6084 4.01329 10.5317 4.01329 10.5061C3.88548 9.99488 3.62985 9.53475 3.34867 9.07463C3.27198 8.97238 3.19529 8.87013 3.11861 8.74232V8.71676C3.14417 8.71676 3.14417 8.71676 3.16973 8.71676C4.11554 8.71676 5.06134 8.71676 6.00715 8.71676C6.05828 8.71676 6.08384 8.6912 6.13496 8.66564C6.79958 8.23108 7.51533 7.89876 8.25664 7.64314C8.79345 7.4642 9.33026 7.31083 9.89263 7.20858C10.4294 7.10633 10.9662 7.02964 11.5286 7.00408C12.8579 6.90183 13.9315 7.02964 14.6472 7.13189C15.184 7.20858 15.6953 7.33639 16.2065 7.48977C17.1012 7.77095 17.9192 8.15439 18.7116 8.64007C18.7628 8.66564 18.8394 8.6912 18.9161 8.6912C19.8364 8.6912 20.7566 8.6912 21.6769 8.6912C21.7536 8.6912 21.8302 8.6912 21.9069 8.6912C21.9069 8.71676 21.9069 8.71676 21.9069 8.71676C21.8558 8.79345 21.8302 8.84457 21.7791 8.92126C21.4724 9.40694 21.1912 9.89263 21.0378 10.455C21.0122 10.5061 21.0122 10.5572 21.0634 10.6339C21.8814 11.8098 22.137 13.1135 21.8047 14.5194C21.4468 15.7208 20.7566 16.6667 19.683 17.3568Z" fill="#cc9933"/>
<path d="M7.71982 11.7844C6.90182 11.7844 6.21164 12.4746 6.21164 13.2926C6.21164 14.1362 6.90182 14.8008 7.74538 14.8008C8.56338 14.8008 9.25356 14.1106 9.25356 13.267C9.25356 12.449 8.58894 11.7844 7.71982 11.7844ZM7.74538 14.085C7.31082 14.085 6.95295 13.7527 6.95295 13.2926C6.95295 12.858 7.28526 12.5257 7.71982 12.5257C8.15438 12.5257 8.48669 12.858 8.51225 13.2926C8.53781 13.7272 8.17994 14.0595 7.74538 14.085Z" fill="#cc9933"/>
<path d="M17.1012 9.61152C15.0562 9.66264 13.4458 11.2986 13.4202 13.3436C13.4202 15.4142 15.1073 17.1268 17.1779 17.1013C19.2484 17.1013 20.9356 15.4397 20.9356 13.3436C20.9356 11.1964 19.1718 9.56039 17.1012 9.61152ZM17.2801 15.6187C15.9253 15.6698 14.8517 14.5962 14.8517 13.2925C14.8517 11.9633 15.9509 10.9408 17.1779 10.9663C18.456 10.9663 19.5041 11.9888 19.5041 13.2925C19.5041 14.5706 18.4816 15.5675 17.2801 15.6187Z" fill="#cc9933"/>
<path d="M13.9826 9.86723C14.8006 9.10035 15.7975 8.71692 16.9223 8.61467C15.593 8.02674 14.1871 7.77111 12.73 7.74555C11.094 7.71999 9.48361 7.95005 7.97543 8.58911C9.12574 8.6658 10.1227 9.04923 10.9662 9.8161C11.8098 10.583 12.2955 11.5543 12.4744 12.6791C12.6789 11.5799 13.1646 10.6341 13.9826 9.86723Z" fill="#cc9933"/>
</g>
<defs>
<clipPath id="clip0">
<rect width="25" height="25" fill="white"/>
</clipPath>
</defs>
</svg>
